{"text_format":"1","workbook":"xlsx","n_sheets":9,"sheets":["Menu","Pick Lists","Plant Inspection","Loose Mix","Density","LongDensity","Properties","Help","Summary"],"not_rendered":{"charts":0,"images":40,"macros":1,"external_links":0,"defined_names":25,"comments":2,"pivot_tables":0},"unopened":[],"bounds":{"document_bytes":16777216,"sheet_cells":100000,"rows_first":2000,"rows_last":500,"rows_between":2000,"halvings":0,"cell_chars":16384,"cell_head_chars":4096},"cells_cut":0,"cells_raw":0,"read":"whole","date_system":"1900"}

{"sheet":"Menu","index":0,"n_rows":21,"n_cols":26,"rows_kept":21,"cut":false,"hidden":false,"merged":[[7,1,7,5],[12,1,12,5],[9,6,9,10],[8,1,8,5],[9,1,9,5],[10,1,10,5],[11,1,11,5]]}
[]
[]
[]
[]
[]
[]
[]
["Date"]
["Mix #"]
["Lot #",null,null,null,null,null,"Sublot Designations:",null,null,null,null,"A","B","C","D"]
{"$rows_left_out":12}
{"sheet":"Pick Lists","index":1,"n_rows":450,"n_cols":11,"rows_kept":450,"cut":false,"hidden":false,"merged":[]}
["Plant Identification",{"$f":"COUNTIF(A3:A400,\"<> - \")","v":398},null,null,null,null,null,"Mixture Types"]
[null,null,null,null,null,null,null,"New",null,"Old"]
[{"$f":"B3&\" - \"&C3","v":"Producer Supplier Name - Plant ID"},"Producer Supplier Name","Plant ID","Plant Type","Producer Supplier Code","Status",null,"Material Short Name","Material Code","Material Short NameO","Material Code"]
["APAC - Asphalt Plants  - Agency         ","APAC - Asphalt Plants ","Agency         ","3176700025     ","DRUM","A   ",null,"Asphalt Stab PB","0302PBAS","Asphalt Stab PB","0302PBAS"]
["APAC - Asphalt Plants  - Auxvasse       ","APAC - Asphalt Plants ","Auxvasse       ","3176700025     ","DRUM","A   ",null,"Comm Mix PMBB","0401BPCMBB","Comm Mix PMBB","0401BPCMBB"]
["APAC - Asphalt Plants  - Bear Hollow    ","APAC - Asphalt Plants ","Bear Hollow    ","3176700025     ","DRUM","A   ",null,"Comm Mix PMBP","0401BPCMBP","Comm Mix PMBP","0401BPCMBP"]
["APAC - Asphalt Plants  - Boonville      ","APAC - Asphalt Plants ","Boonville      ","3176700025     ","DRUM","A   ",null,"Micro-Surfacing T2","0413MST2","Commercial Mix PMBP","0401BPCM"]
["APAC - Asphalt Plants  - Branson        ","APAC - Asphalt Plants ","Branson        ","3176700025     ","DRUM","A   ",null,"Micro-Surfacing T3","0413MST3","Plant Mix Bit Base","0301SBBI"]
["APAC - Asphalt Plants  - Brookfield     ","APAC - Asphalt Plants ","Brookfield     ","3176700025     ","DRUM","A   ",null,"Plt Mix Bit Base","0401BPPMBB","Plt Mix for BP-1","0401BPPMBP..1"]
["APAC - Asphalt Plants  - Butler         ","APAC - Asphalt Plants ","Butler         ","3176700025     ","DRUM","A   ",null,"Plt Mix for BP-1","0401BPPMBP..1","Plt Mix for BP-2","0401BPPMBP..2"]
{"$rows_left_out":441}
{"sheet":"Plant Inspection","index":2,"n_rows":124,"n_cols":41,"rows_kept":124,"cut":false,"hidden":false,"merged":[[69,10,69,11],[43,20,43,21],[41,9,41,10],[42,9,42,10],[43,9,43,10],[51,7,51,10],[65,10,65,11],[65,12,65,13],[66,12,66,13],[66,10,66,11],[67,10,67,11],[6,26,6,31],[63,5,63,7],[53,13,53,24],[59,7,59,8],[52,7,52,8],[53,7,53,8],[49,15,49,24],[61,8,61,13],[62,10,62,11],[62,12,62,13],[63,10,63,11],[50,13,50,24],[51,13,51,24],[52,13,52,24],[41,20,41,21],[42,20,42,21],[80,0,83,1],[45,13,48,14],[44,13,44,15],[46,1,46,5],[70,5,70,7],[63,0,63,1],[64,0,64,1],[65,0,65,1],[66,0,66,1],[67,0,67,1],[67,5,67,7],[64,5,64,7],[65,5,65,7],[54,14,54,24],[68,5,68,7],[64,10,64,11],[3,31,3,32],[2,28,2,30],[2,19,2,21],[2,23,2,24],[3,28,3,29],[2,25,2,27],[3,20,3,26],[3,17,3,19],[2,17,2,18],[2,15,2,16],[3,14,3,16],[63,2,63,4],[64,2,64,4],[55,7,55,8],[56,7,56,8],[57,7,57,8],[58,7,58,8],[64,12,64,13],[63,8,63,9],[63,12,63,13],[64,8,64,9],[54,7,54,8],[68,0,68,1],[69,0,69,1],[70,0,70,1],[67,2,67,4],[68,2,68,4],[69,2,69,4],[70,2,70,4],[70,10,70,11],[68,8,68,9],[67,12,67,13],[68,12,68,13],[65,2,65,4],[66,2,66,4],[69,5,69,7],[66,5,66,7],[70,8,70,9],[66,8,66,9],[67,8,67,9],[65,8,65,9],[69,8,69,9],[69,12,69,13],[70,12,70,13],[68,10,68,11]]}
[null,null,null,null,null,null,null,null,null,null,null,null,null,"MISSOURI DEPARTMENT OF TRANSPORTATION",null,null,null,null,null,null,null,null,null,null,null,null,null,null,{"$f":"IF(Menu!I8=TRUE,\"Warm Mix\",\"\")","v":""},null,null,"SHEET",{"$f":"E5","v":1},"OF",{"$f":"H4","v":1}]
[null,null,"              TYPE IN BLUE SPACES ONLY",null,null,null,null,null,null,null,null,null,null,"PLANT INSPECTOR'S WORKSHEET"]
["INSPECTOR",null,null,null,null,null,null,null,null,null,null,null,null,"Contract",null,{"$f":"Menu!B11","v":0},null,"Job Number",null,{"$f":"Menu!B12","v":0},null,null,"Route",{"$f":"Menu!B13","v":0},null,"Bituminous Mix No.",null,null,{"$f":"UPPER(Menu!B9)","v":{"$error":"#VALUE!"}},null,null,null,"   Report No.",null,{"$f":"E4","v":1}]
["REPORT    NUMBER",null,null,null,1,null,"Total Sheets",1,null,null,null,null,null,"County",{"$f":"Menu!B14","v":0},null,null,"     Plant & Location",null,null,{"$f":"Menu!B18","v":0},null,null,null,null,null,null,"Date",{"$f":"Menu!B8","v":"00:00:00"},null,"Smpl ID",{"$f":"UPPER(Menu!B7)","v":{"$error":"#VALUE!"}},null,"Time",{"$f":"E6","v":0}]
["SHEET    NUMBER",null,null,null,1]
["TIME",null,null,null,null,null,null,null,null,null,null,null,null,"Gradation of Bin Materials ",null,null,null,null,null,null,null,null,null,null,null,null,"Gradation of Final Mix"]
["ASPHALT CEMENT SOURCE",null,null,null,null,null,null,null,null,null,null,null,null,null,"Bin No. 1",null,"Bin No. 2",null,"Bin No. 3",null,"Bin No. 4",null,{"$f":"J23","v":"RAP*"},null,{"$f":"IF($K$23=\"RAS\",\"RAS\",(IF($K$23=\"HydLim\",\"Hydrated Lime\",IF($K$23=\"MinFill\",\"Mineral Filler\",\"\"))))","v":"RAS"},null,"Proportions (% Used)"]
["ASPHALT CEMENT GRADE",null,null,null,null,null,null,null,null,null,null,null,null,"Sieve","Wt.","Per-","Wt.","Per-","Wt.","Per-","Wt.","Per-","Wt.","Per-","Wt.","Per-","Bin 1","Bin 2","Bin 3","Bin 4",{"$f":"J23","v":"RAP*"},{"$f":"IF($K$23=\"HydLim\",\"Hyd.Lime\",IF($K$23=\"MinFill\",\"Min.Filler\",\"\"))","v":"Hyd.Lime"},"Combined ","Combined","Deviation"]
["TOTAL AC %",null,null,null,null,null,null,null,null,null,null,null,null,"Size","Grams","cent","Grams","cent","Grams","cent","Grams","cent","Grams","cent","Grams","cent",{"$f":"B44","v":0},0,0,0,{"$f":"IF(C44=\"\",F44,\"\")","v":0},0,"Gradation","Job Mix"]
["MINERAL AGGRAGATE %",null,null,null,{"$f":"100-E9-J44","v":100},null,null,null,null,null,null,null,null,null,{"$f":"B24","v":0}," ",{"$f":"D24","v":0}," ",{"$f":"F24","v":0}," ",{"$f":"H24","v":0}," ",{"$f":"J24","v":0}," ",null," ",null,null,null,null,null," "]
{"$rows_left_out":115}
{"sheet":"Loose Mix","index":3,"n_rows":98,"n_cols":20,"rows_kept":98,"cut":false,"hidden":false,"merged":[[11,1,11,3],[21,10,21,11],[6,5,6,6],[10,10,10,11],[17,5,17,6],[33,10,33,11],[93,10,93,11],[81,10,81,11],[69,10,69,11],[57,10,57,11],[45,10,45,11]]}
[null,null,null,null,"LOOSE MIX"]
["No. Tons",3000,null,null,null,null,null,null,null,null,null,null,null,null,null,null,null,null,{"$f":"ROUND(RAND(),4)","v":0.63300000000000001},{"$f":"ROUND(RAND(),4)","v":0.1024}]
["Tons per Sublot",null,null,null,"JOB",{"$f":"Menu!B12","v":0},null,"ROUTE",{"$f":"Menu!B13","v":0},"MIX NO.",{"$f":"UPPER(Menu!B9)","v":{"$error":"#VALUE!"}},null,"LOT NO.",{"$f":"Menu!B10","v":0}]
[{"$f":"Menu!L10","v":"A"},750]
[{"$f":"Menu!M10","v":"B"},750,null,null,"NO. TONS",{"$f":"IF(B2=\"\",\"\",B2)","v":3000},null,"QA SAMPLE",null,"TONS  \"T\"",null,null,{"$f":"B2","v":3000}]
[{"$f":"Menu!N10","v":"C"},750,null,null,null,null,null,null,null,"BEGINNING TONS \"BT\"",null,null,0]
[{"$f":"Menu!O10","v":"D"},750,null,null,"TECHNICIAN","mrm",null,null,null,"ENDING TONS \"ET\"",null,null,{"$f":"M5+M6","v":3000}]
[{"$f":"Menu!P10","v":0},null,null,null,null,null,null,null,null,"WIDTH",null,null,12]
[{"$f":"Menu!Q10","v":0}]
[{"$f":"Menu!R10","v":0},null,null,null,"     RANDOM NO.",null,null,"T","A","X=T x A","TONS = BT + X"]
{"$rows_left_out":89}
{"sheet":"Density","index":4,"n_rows":68,"n_cols":24,"rows_kept":68,"cut":false,"hidden":false,"merged":[[44,8,44,9],[53,8,53,9],[62,8,62,9],[8,8,8,9],[17,8,17,9],[26,8,26,9],[35,8,35,9],[44,14,44,15],[53,14,53,15],[62,14,62,15],[8,14,8,15],[17,14,17,15],[26,14,26,15],[35,14,35,15]]}
["MAT COMPACTION"]
[null,null,null,null,null,null,null,null,null,null,null,null,null,null,null,null,null,null,null,null,{"$f":"ROUND(RAND(),4)","v":5.7099999999999998E-2},{"$f":"ROUND(RAND(),4)","v":0.69040000000000001}]
["JOB",{"$f":"Properties!B3","v":0},null,"ROUTE",{"$f":"Properties!E3","v":0},"MIX NO.",{"$f":"UPPER(Properties!G3)","v":{"$error":"#VALUE!"}},null,"LOT NO.",{"$f":"Properties!J3","v":0}]
[]
["SUBLOT",{"$f":"IF(+'Loose Mix'!F16=\" \",\" \",+'Loose Mix'!F16)","v":"A"},null,null,null,null,"A","B","EDGE",null,null,null,"A","B","EDGE",null,null,null,null,null,null,1]
["TONS IN SUBLOT",null,null,{"$f":"'Loose Mix'!M16","v":750},null,"RANDOM NO.",null,null,{"$f":"W8","v":0},null,null,"RANDOM NO.",null,null,{"$f":"X8","v":0},null,null,null,null,null,null,{"$f":"ROUND(H9-IF(AND(0<=H9,H9<=V9),V8,IF(AND(V9<H9,H9<=V10),V9,IF(AND(V10<H9,H9<=V11),V10,IF(AND(V11<H9,H9<=V12),V11,IF(AND(V12<H9,H9<=V13),V12,V13))))),0)","v":0},{"$f":"ROUND(N9-IF(AND(0<=N9,N9<=V9),V8,IF(AND(V9<N9,N9<=V10),V9,IF(AND(V10<N9,N9<=V11),V10,IF(AND(V11<N9,N9<=V12),V11,IF(AND(V12<N9,N9<=V13),V12,V13))))),0)","v":0}]
["BEGIN STA./LM",null,null,{"$f":"'Loose Mix'!B14","v":200},null,null,null,null,null,null,null,null,null,null,null,null,null,null,null,null,null,{"$f":"V6+IF(AND(V8<=H9,H9<=V9),'Loose Mix'!B14,IF(AND(V9<H9,H9<=V10),'Loose Mix'!B15,IF(AND(V10<H9,H9<=V11),'Loose Mix'!B16,IF(AND(V11<H9,H9<=V12),'Loose Mix'!B17,IF(AND(V12<H9,H9<=V13),'Loose Mix'!B18,'Loose Mix'!B19)))))","v":200},{"$f":"W6+IF(AND(V8<=N9,N9<=V9),'Loose Mix'!B14,IF(AND(V9<N9,N9<=V10),'Loose Mix'!B15,IF(AND(V10<N9,N9<=V11),'Loose Mix'!B16,IF(AND(V11<N9,N9<=V12),'Loose Mix'!B17,IF(AND(V12<N9,N9<=V13),'Loose Mix'!B18,'Loose Mix'!B19)))))","v":200}]
["ENDING STA./LM",null,null,{"$f":"INDEX('Loose Mix'!D14:'Loose Mix'!D19,COUNT('Loose Mix'!D14:'Loose Mix'!D19),1)","v":300},null,"L","A","X=L x A","STA + X",null,null,"L2","A","X=L+L2xA","STA + X",null,null,null,null,null,null,0,{"$f":"IF(AND(V8<=H9,H9<=V9),S9,IF(AND(V9<H9,H9<=V10),S10,IF(AND(V10<H9,H9<=V11),S11,IF(AND(V11<H9,H9<=V12),S12,IF(AND(V12<H9,H9<=V13),S13,S14)))))","v":0},{"$f":"IF(AND(V8<=N9+F9,N9+F9<=V9),S9,IF(AND(V9<N9+F9,N9+F9<=V10),S10,IF(AND(V10<F9,F9<=V11),S11,IF(AND(V11<F9,F9<=V12),S12,IF(AND(V12<F9,F9<=V13),S13,S14)))))","v":0}]
["LENGTH \"L\"",null,null,{"$f":"V14","v":100},null,{"$f":"IF($V$5=2,ROUND(D9/2,0),ROUND(D9,0))","v":100},{"$f":"G6","v":0},{"$f":"F9*G9","v":0},{"$f":"IF(B5=\"\",\"\",V7)","v":200},null,null,{"$f":"IF($V$5=2,ROUND(D9/2,0),0)","v":0},{"$f":"M6","v":0},{"$f":"IF($V$5=2,F9+L9*M9,0)","v":0},{"$f":"IF(AND($V$5=2,B5<>\"\"),W7,\"\")","v":""},null,null,null,{"$f":"'Loose Mix'!A14","v":0},null,{"$f":"'Loose Mix'!D14-'Loose Mix'!B14","v":100},{"$f":"U9","v":100}]
["WIDTH \"W\"",null,null,{"$f":"'Loose Mix'!M19","v":12},null,"W2","B",{"$f":"\"OFFSET=\"&TEXT(IF(I6>0,0.5,0),\"0.0\")&\"+W2XB\"","v":"OFFSET=0.0+W2XB"},null,null,null,"W2","B",{"$f":"\"OFFSET=\"&TEXT(IF(O6>0,0.5,0),\"0.0\")&\"+W2XB\"","v":"OFFSET=0.0+W2XB"},null,null,null,null,{"$f":"'Loose Mix'!A15","v":0},null,{"$f":"'Loose Mix'!D15-'Loose Mix'!B15","v":0},{"$f":"U10+V9","v":100}]
{"$rows_left_out":59}
{"sheet":"LongDensity","index":5,"n_rows":68,"n_cols":24,"rows_kept":68,"cut":false,"hidden":false,"merged":[[44,8,44,9],[53,8,53,9],[62,8,62,9],[8,8,8,9],[17,8,17,9],[26,8,26,9],[35,8,35,9],[44,14,44,15],[53,14,53,15],[62,14,62,15],[8,14,8,15],[17,14,17,15],[26,14,26,15],[35,14,35,15]]}
["LONGITUDINAL JOINT DENSITY"]
[null,null,null,null,null,null,null,null,null,null,null,null,null,null,null,null,null,null,null,null,{"$f":"ROUND(RAND(),4)","v":0.7258},{"$f":"ROUND(RAND(),4)","v":0.8478}]
["JOB",{"$f":"Properties!B3","v":0},null,"ROUTE",{"$f":"Properties!E3","v":0},"MIX NO.",{"$f":"UPPER(Properties!G3)","v":{"$error":"#VALUE!"}},null,"LOT NO.",{"$f":"Properties!J3","v":0}]
[]
["SUBLOT",{"$f":"IF(+'Loose Mix'!F16=\" \",\" \",+'Loose Mix'!F16)","v":"A"},null,null,null,null,"A","B","EDGE",null,null,null,"A","B","EDGE"]
["TONS IN SUBLOT",null,null,{"$f":"'Loose Mix'!M16","v":750},null,"RANDOM NO.",null,null,{"$f":"W8","v":0},null,null,"RANDOM NO.",null,null,{"$f":"X8","v":0},null,null,null,null,null,null,{"$f":"ROUND(H9-IF(AND(0<=H9,H9<=V9),V8,IF(AND(V9<H9,H9<=V10),V9,IF(AND(V10<H9,H9<=V11),V10,IF(AND(V11<H9,H9<=V12),V11,IF(AND(V12<H9,H9<=V13),V12,V13))))),0)","v":0},{"$f":"ROUND(N9-IF(AND(0<=N9,N9<=V9),V8,IF(AND(V9<N9,N9<=V10),V9,IF(AND(V10<N9,N9<=V11),V10,IF(AND(V11<N9,N9<=V12),V11,IF(AND(V12<N9,N9<=V13),V12,V13))))),0)","v":0}]
["BEGIN STA./LM",null,null,{"$f":"'Loose Mix'!B14","v":200},null,null,null,null,null,null,null,null,null,null,null,null,null,null,null,null,null,{"$f":"V6+IF(AND(V8<=H9,H9<=V9),'Loose Mix'!B14,IF(AND(V9<H9,H9<=V10),'Loose Mix'!B15,IF(AND(V10<H9,H9<=V11),'Loose Mix'!B16,IF(AND(V11<H9,H9<=V12),'Loose Mix'!B17,IF(AND(V12<H9,H9<=V13),'Loose Mix'!B18,'Loose Mix'!B19)))))","v":200},{"$f":"W6+IF(AND(V8<=N9,N9<=V9),'Loose Mix'!B14,IF(AND(V9<N9,N9<=V10),'Loose Mix'!B15,IF(AND(V10<N9,N9<=V11),'Loose Mix'!B16,IF(AND(V11<N9,N9<=V12),'Loose Mix'!B17,IF(AND(V12<N9,N9<=V13),'Loose Mix'!B18,'Loose Mix'!B19)))))","v":200}]
["ENDING STA./LM",null,null,{"$f":"INDEX('Loose Mix'!D14:'Loose Mix'!D19,COUNT('Loose Mix'!D14:'Loose Mix'!D19),1)","v":300},null,"L","A","X=L x A","STA + X",null,null,"L2","A","X=L+L2xA","STA + X",null,null,null,null,null,null,0,{"$f":"IF(AND(V8<=H9,H9<=V9),S9,IF(AND(V9<H9,H9<=V10),S10,IF(AND(V10<H9,H9<=V11),S11,IF(AND(V11<H9,H9<=V12),S12,IF(AND(V12<H9,H9<=V13),S13,S14)))))","v":0},{"$f":"IF(AND(V8<=N9+F9,N9+F9<=V9),S9,IF(AND(V9<N9+F9,N9+F9<=V10),S10,IF(AND(V10<F9,F9<=V11),S11,IF(AND(V11<F9,F9<=V12),S12,IF(AND(V12<F9,F9<=V13),S13,S14)))))","v":0}]
["LENGTH \"L\"",null,null,{"$f":"V14","v":0},null,{"$f":"IF($V$5=2,ROUND(D9/2,0),ROUND(D9,0))","v":0},{"$f":"G6","v":0},{"$f":"F9*G9","v":0},{"$f":"IF(I6>0,V7,\"\")","v":""},null,null,{"$f":"IF($V$5=2,ROUND(D9/2,0),0)","v":0},{"$f":"M6","v":0},{"$f":"IF($V$5=2,F9+L9*M9,0)","v":0},{"$f":"IF($V$5=2,W7,0)","v":0},null,null,null,{"$f":"'Loose Mix'!A14","v":0},null,{"$f":"IF(S9>0,'Loose Mix'!D14-'Loose Mix'!B14,0)","v":0},{"$f":"U9","v":0}]
[null,null,null,null,null,null,null,null,{"$f":"IF(AND(I6=2,H6>=0.5),\"OPPOSITE SIDE\",\"\")","v":""},null,null,"W2","B",{"$f":"\"OFFSET=\"&TEXT(IF(O6>0,0.5,0),\"0.0\")&\"+W2XB\"","v":"OFFSET=0.0+W2XB"},null,null,null,null,{"$f":"'Loose Mix'!A15","v":0},null,{"$f":"IF(S10>0,'Loose Mix'!D15-'Loose Mix'!B15,0)","v":0},{"$f":"U10+V9","v":0}]
{"$rows_left_out":59}
{"sheet":"Properties","index":6,"n_rows":144,"n_cols":19,"rows_kept":144,"cut":false,"hidden":false,"merged":[]}
["SUPERPAVE MIXTURE PROPERTIES"]
[]
["JOB",{"$f":"'Loose Mix'!F3","v":0},null,"ROUTE",{"$f":"'Loose Mix'!I3","v":0},"MIX NO.",{"$f":"'Loose Mix'!K3","v":{"$error":"#VALUE!"}},null,"LOT NO.",{"$f":"'Loose Mix'!N3","v":0}]
[]
["SUBLOT",null,null,null,null,{"$f":"IF(+'Loose Mix'!F16=\" \",\" \",+'Loose Mix'!F16)","v":"A"},{"$f":"IF('Loose Mix'!F28=\" \",\" \",+'Loose Mix'!F28)","v":"B"},{"$f":"IF('Loose Mix'!F40=\" \",\" \",+'Loose Mix'!F40)","v":"C"},{"$f":"IF('Loose Mix'!F52=\" \",\" \",+'Loose Mix'!F52)","v":"D"},{"$f":"IF('Loose Mix'!F64=\" \",\" \",+'Loose Mix'!F64)","v":""},{"$f":"IF('Loose Mix'!F76=\" \",\" \",+'Loose Mix'!F76)","v":""},{"$f":"IF('Loose Mix'!F88=\" \",\" \",+'Loose Mix'!F88)","v":""}]
["DATE"]
["AASHTO T 209",null,null,null,null,"A2 required when T85 absorption >2.0% on any aggregate fraction."]
["TECHNICIAN"]
["A = Wt. of sample:"]
["A2=Wt. of sample (dry-back):"]
{"$rows_left_out":135}
{"sheet":"Help","index":7,"n_rows":0,"n_cols":0,"rows_kept":0,"cut":false,"hidden":false,"merged":[]}

{"sheet":"Summary","index":8,"n_rows":152,"n_cols":10,"rows_kept":152,"cut":false,"hidden":false,"merged":[[133,8,133,9],[129,8,129,9],[130,8,130,9],[131,8,131,9],[132,8,132,9],[123,8,123,9],[124,8,124,9],[125,8,125,9],[127,8,127,9],[128,8,128,9],[94,8,94,9],[95,8,95,9],[96,8,96,9],[97,8,97,9],[99,8,99,9],[36,8,36,9],[37,8,37,9],[38,8,38,9],[39,8,39,9],[57,8,57,9],[56,8,56,9],[55,8,55,9],[31,8,31,9],[32,8,32,9],[33,8,33,9],[34,8,34,9],[35,8,35,9],[26,8,26,9],[27,8,27,9],[28,8,28,9],[29,8,29,9],[30,8,30,9],[0,0,0,3],[21,8,21,9],[22,8,22,9],[23,8,23,9],[25,8,25,9],[90,8,90,9],[60,8,60,9],[61,8,61,9],[91,8,91,9],[93,8,93,9],[59,8,59,9],[62,8,62,9],[63,8,63,9],[65,8,65,9],[89,8,89,9]]}
["INSPECTOR WORKSHEET SUMMARY"]
["SMPL_ID",{"$f":"UPPER(Menu!B7)","v":""},"Updated","No"]
["SMPLD_BY",{"$f":"LOWER(Menu!H7)","v":""}]
["MATL_CD",{"$f":"IF(OR(Menu!B19=\"Material Short Name\",ISERR(Menu!B19)),VLOOKUP(Menu!B20,'Pick Lists'!J3:K60,2,FALSE),VLOOKUP(Menu!B19,'Pick Lists'!H3:I65,2,FALSE))","v":{"$error":"#N/A"}}]
["PRODR_SUPP_CD",{"$f":"VLOOKUP(Menu!B18,Producer_Supplier,4,FALSE)","v":{"$error":"#N/A"}}]
["PLANT_ID",{"$f":"VLOOKUP(Menu!B18,Producer_Supplier,3,FALSE)","v":{"$error":"#N/A"}}]
["REPR_QTY",{"$f":"SUM(B17:J17)","v":0}]
["SMPL_DT",{"$f":"Menu!B8","v":0}]
["SMPL_MIX-_ID",{"$f":"UPPER(Menu!B9)","v":""}]
["STD_RMRKS_IND",{"$f":"IF(Menu!$I$8=TRUE,\"Y\",\" \")","v":" "},"(Warm Mix)"]
{"$rows_left_out":142}