{"text_format":"1","workbook":"xlsx","n_sheets":3,"sheets":["Instructions and information","Data entry","Printed_Form"],"not_rendered":{"charts":0,"images":0,"macros":1,"external_links":0,"defined_names":3,"comments":1,"pivot_tables":0},"unopened":[],"bounds":{"document_bytes":16777216,"sheet_cells":100000,"rows_first":2000,"rows_last":500,"rows_between":2000,"halvings":0,"cell_chars":16384,"cell_head_chars":4096},"cells_cut":0,"cells_raw":0,"read":"whole","date_system":"1900"}

{"sheet":"Instructions and information","index":0,"n_rows":15,"n_cols":2,"rows_kept":15,"cut":false,"hidden":false,"merged":[[16,1,16,13],[18,1,18,13],[20,1,20,13],[22,2,22,13],[23,2,23,13],[32,2,32,13],[35,2,35,13],[34,2,34,13],[33,2,33,13],[24,2,24,13],[26,1,26,13],[28,1,28,13],[30,1,30,13],[1,1,1,13],[2,1,2,13],[3,1,3,13],[4,1,4,13],[6,1,6,13],[7,1,7,13],[9,1,9,13],[11,1,11,13],[14,1,14,13],[12,1,12,12],[10,1,10,12],[13,1,13,12]]}
[]
[null,"Instructions for Completing the DBE Identification Submittal Form ECR-100"]
[]
[]
[null,"Fill out this form on the 'Data Entry' Worksheet per the instructions below.  You will then need to go to the 'Printed_Form' Worksheet to Review and save the file as a PDF by using the button provided. The File should open in your default PDF application where you will then need to apply your Digital Signature.  "]
[]
[null,"Submit this form with your bid or to the External Civil Rights Division no later than 4:00 p.m. on the 3rd working day after the bid\nopening. Only DBE's listed on MoDOT's Missouri Regional Certification Committee (MRCC) directory may be used towards\nobtaining the DBE goal on the project. DBE firm must be certified with the appropriate North American Industrial Classification\nSystem (NAICS) code for the type of work being utilized to perform. The MRCC directory is available at the following link:"]
[null,"https://www.modot.org/mrcc-directory"]
{"$rows_left_out":8}
{"sheet":"Data entry","index":1,"n_rows":194,"n_cols":27,"rows_kept":194,"cut":false,"hidden":false,"merged":[[186,12,186,14],[161,12,161,14],[162,12,162,14],[163,12,163,14],[164,12,164,14],[165,12,165,14],[166,12,166,14],[167,12,167,14],[168,12,168,14],[169,12,169,14],[10,0,14,14],[18,0,19,14],[21,8,21,9],[22,10,22,14],[178,12,178,14],[179,12,179,14],[180,12,180,14],[181,12,181,14],[182,12,182,14],[148,12,148,14],[149,12,149,14],[150,12,150,14],[151,12,151,14],[152,12,152,14],[153,12,153,14],[154,12,154,14],[155,12,155,14],[188,12,188,14],[189,9,189,11],[183,9,183,11],[184,9,184,11],[185,9,185,11],[186,9,186,11],[188,9,188,11],[154,9,154,11],[155,9,155,11],[161,9,161,11],[170,12,170,14],[171,12,171,14],[187,12,187,14],[189,12,189,14],[183,12,183,14],[184,12,184,14],[185,12,185,14],[41,12,41,14],[42,12,42,14],[43,12,43,14],[44,12,44,14],[45,12,45,14],[46,12,46,14],[47,12,47,14],[48,12,48,14],[49,12,49,14],[50,12,50,14],[51,12,51,14],[52,12,52,14],[53,12,53,14],[54,12,54,14],[55,12,55,14],[56,12,56,14],[57,12,57,14],[58,12,58,14],[59,12,59,14],[60,12,60,14],[61,12,61,14],[62,12,62,14],[147,12,147,14],[179,9,179,11],[180,9,180,11],[181,9,181,11],[182,9,182,11],[162,9,162,11],[163,9,163,11],[164,9,164,11],[165,9,165,11],[166,9,166,11],[167,9,167,11],[168,9,168,11],[169,9,169,11],[178,9,178,11],[148,9,148,11],[149,9,149,11],[150,9,150,11],[151,9,151,11],[152,9,152,11],[153,9,153,11],[188,6,188,8],[189,6,189,8],[41,9,41,11],[42,9,42,11],[43,9,43,11],[44,9,44,11],[45,9,45,11],[46,9,46,11],[47,9,47,11],[48,9,48,11],[49,9,49,11],[50,9,50,11],[51,9,51,11],[52,9,52,11],[53,9,53,11],[54,9,54,11],[55,9,55,11],[56,9,56,11],[57,9,57,11],[58,9,58,11],[59,9,59,11],[60,9,60,11],[61,9,61,11],[62,9,62,11],[167,6,167,8],[168,6,168,8],[169,6,169,8],[170,6,170,8],[171,6,171,8],[172,6,172,8],[180,6,180,8],[181,6,181,8],[182,6,182,8],[150,6,150,8],[151,6,151,8],[152,6,152,8],[153,6,153,8],[154,6,154,8],[155,6,155,8],[164,6,164,8],[165,6,165,8],[166,6,166,8],[169,3,169,5],[170,3,170,5],[171,3,171,5],[172,3,172,5],[173,3,173,5],[188,3,188,5],[189,3,189,5],[40,6,40,8],[48,6,48,8],[49,6,49,8],[50,6,50,8],[51,6,51,8],[52,6,52,8],[53,6,53,8],[54,6,54,8],[55,6,55,8],[56,6,56,8],[57,6,57,8],[58,6,58,8],[59,6,59,8],[147,6,147,8],[148,6,148,8],[149,6,149,8],[41,6,41,8],[148,3,148,5],[149,3,149,5],[150,3,150,5],[151,3,151,5],[152,3,152,5],[153,3,153,5],[154,3,154,5],[155,3,155,5],[168,3,168,5],[16,0,16,14],[21,0,21,1],[21,2,21,6],[5,0,5,1],[5,2,5,6],[5,8,5,9],[5,10,5,14],[21,10,21,14],[147,3,147,5],[40,9,40,11],[40,12,40,14],[42,6,42,8],[43,6,43,8],[44,6,44,8],[45,6,45,8],[46,6,46,8],[47,6,47,8],[147,9,147,11],[24,0,24,10],[24,11,24,14],[34,1,34,6],[26,1,28,6],[29,1,29,6],[31,1,33,6],[0,0,0,15],[1,0,1,15],[3,0,3,1],[3,2,3,6],[3,8,3,9],[3,10,3,14],[7,0,7,2],[7,3,7,7],[7,8,7,10],[7,11,7,14],[36,6,36,8],[37,6,39,8],[36,9,36,11],[37,9,39,11],[36,12,36,14],[37,12,39,14],[37,1,39,2],[36,1,36,2],[40,1,40,2],[40,3,40,5],[41,1,41,2],[42,1,42,2],[41,3,41,5],[42,3,42,5],[43,1,43,2],[36,3,36,5],[37,3,39,5],[44,1,44,2],[43,3,43,5],[44,3,44,5],[45,1,45,2],[46,1,46,2],[45,3,45,5],[46,3,46,5],[47,1,47,2],[48,1,48,2],[47,3,47,5],[48,3,48,5],[49,1,49,2],[50,1,50,2],[49,3,49,5],[50,3,50,5],[51,1,51,2],[52,1,52,2],[51,3,51,5],[52,3,52,5],[53,1,53,2],[54,1,54,2],[53,3,53,5],[54,3,54,5],[55,1,55,2],[56,1,56,2],[55,3,55,5],[56,3,56,5],[57,1,57,2],[58,1,58,2],[57,3,57,5],[58,3,58,5],[59,1,59,2],[60,1,60,2],[59,3,59,5],[60,3,60,5],[60,6,60,8],[61,1,61,2],[62,1,62,2],[61,3,61,5],[62,3,62,5],[61,6,61,8],[62,6,62,8],[63,1,63,2],[64,1,64,2],[63,3,63,5],[64,3,64,5],[63,6,63,8],[64,6,64,8],[64,9,64,11],[63,12,63,14],[64,12,64,14],[63,9,63,11],[65,1,65,2],[66,1,66,2],[65,3,65,5],[66,3,66,5],[65,6,65,8],[66,6,66,8],[65,9,65,11],[66,9,66,11],[65,12,65,14],[66,12,66,14],[67,1,67,2],[68,1,68,2],[67,3,67,5],[68,3,68,5],[67,6,67,8],[68,6,68,8],[67,9,67,11],[68,9,68,11],[67,12,67,14],[68,12,68,14],[69,1,69,2],[70,1,70,2],[69,3,69,5],[70,3,70,5],[69,6,69,8],[70,6,70,8],[69,9,69,11],[70,9,70,11],[69,12,69,14],[70,12,70,14],[71,1,71,2],[72,1,72,2],[71,3,71,5],[72,3,72,5],[71,6,71,8],[72,6,72,8],[71,9,71,11],[72,9,72,11],[71,12,71,14],[72,12,72,14],[73,1,73,2],[74,1,74,2],[73,3,73,5],[74,3,74,5],[73,6,73,8],[74,6,74,8],[73,9,73,11],[74,9,74,11],[73,12,73,14],[74,12,74,14],[75,1,75,2],[76,1,76,2],[75,3,75,5],[76,3,76,5],[75,6,75,8],[76,6,76,8],[75,9,75,11],[76,9,76,11],[75,12,75,14],[76,12,76,14],[77,1,77,2],[78,1,78,2],[77,3,77,5],[78,3,78,5],[77,6,77,8],[78,6,78,8],[77,9,77,11],[78,9,78,11],[77,12,77,14],[78,12,78,14],[79,1,79,2],[80,1,80,2],[79,3,79,5],[80,3,80,5],[79,6,79,8],[80,6,80,8],[79,9,79,11],[80,9,80,11],[79,12,79,14],[80,12,80,14],[81,1,81,2],[82,1,82,2],[81,3,81,5],[82,3,82,5],[81,6,81,8],[82,6,82,8],[81,9,81,11],[82,9,82,11],[81,12,81,14],[82,12,82,14],[83,1,83,2],[84,1,84,2],[83,3,83,5],[84,3,84,5],[83,6,83,8],[84,6,84,8],[83,9,83,11],[84,9,84,11],[83,12,83,14],[84,12,84,14],[85,1,85,2],[86,1,86,2],[85,3,85,5],[86,3,86,5],[85,6,85,8],[86,6,86,8],[85,9,85,11],[86,9,86,11],[85,12,85,14],[86,12,86,14],[87,1,87,2],[88,1,88,2],[87,3,87,5],[88,3,88,5],[87,6,87,8],[88,6,88,8],[87,9,87,11],[88,9,88,11],[87,12,87,14],[88,12,88,14],[89,1,89,2],[90,1,90,2],[89,3,89,5],[90,3,90,5],[89,6,89,8],[90,6,90,8],[89,9,89,11],[90,9,90,11],[89,12,89,14],[90,12,90,14],[91,1,91,2],[92,1,92,2],[91,3,91,5],[92,3,92,5],[91,6,91,8],[92,6,92,8],[91,9,91,11],[92,9,92,11],[91,12,91,14],[92,12,92,14],[93,1,93,2],[94,1,94,2],[93,3,93,5],[94,3,94,5],[93,6,93,8],[94,6,94,8],[93,9,93,11],[94,9,94,11],[93,12,93,14],[94,12,94,14],[95,1,95,2],[96,1,96,2],[95,3,95,5],[96,3,96,5],[95,6,95,8],[96,6,96,8],[95,9,95,11],[96,9,96,11],[95,12,95,14],[96,12,96,14],[97,1,97,2],[98,1,98,2],[97,3,97,5],[98,3,98,5],[97,6,97,8],[98,6,98,8],[97,9,97,11],[98,9,98,11],[97,12,97,14],[98,12,98,14],[99,1,99,2],[100,1,100,2],[99,3,99,5],[100,3,100,5],[99,6,99,8],[100,6,100,8],[99,9,99,11],[100,9,100,11],[99,12,99,14],[100,12,100,14],[101,1,101,2],[102,1,102,2],[101,3,101,5],[102,3,102,5],[101,6,101,8],[102,6,102,8],[101,9,101,11],[102,9,102,11],[101,12,101,14],[102,12,102,14],[103,1,103,2],[104,1,104,2],[103,3,103,5],[104,3,104,5],[103,6,103,8],[104,6,104,8],[103,9,103,11],[104,9,104,11],[103,12,103,14],[104,12,104,14],[105,1,105,2],[106,1,106,2],[105,3,105,5],[106,3,106,5],[105,6,105,8],[106,6,106,8],[105,9,105,11],[106,9,106,11],[105,12,105,14],[106,12,106,14],[107,1,107,2],[108,1,108,2],[107,3,107,5],[108,3,108,5],[107,6,107,8],[108,6,108,8],[107,9,107,11],[108,9,108,11],[107,12,107,14],[108,12,108,14],[109,1,109,2],[110,1,110,2],[109,3,109,5],[110,3,110,5],[109,6,109,8],[110,6,110,8],[109,9,109,11],[110,9,110,11],[109,12,109,14],[110,12,110,14],[111,1,111,2],[112,1,112,2],[111,3,111,5],[112,3,112,5],[111,6,111,8],[112,6,112,8],[111,9,111,11],[112,9,112,11],[111,12,111,14],[112,12,112,14],[113,1,113,2],[114,1,114,2],[113,3,113,5],[114,3,114,5],[113,6,113,8],[114,6,114,8],[113,9,113,11],[114,9,114,11],[113,12,113,14],[114,12,114,14],[115,1,115,2],[116,1,116,2],[115,3,115,5],[116,3,116,5],[115,6,115,8],[116,6,116,8],[115,9,115,11],[116,9,116,11],[115,12,115,14],[116,12,116,14],[117,1,117,2],[118,1,118,2],[117,3,117,5],[118,3,118,5],[117,6,117,8],[118,6,118,8],[117,9,117,11],[118,9,118,11],[117,12,117,14],[118,12,118,14],[119,1,119,2],[120,1,120,2],[119,3,119,5],[120,3,120,5],[119,6,119,8],[120,6,120,8],[119,9,119,11],[120,9,120,11],[119,12,119,14],[120,12,120,14],[121,1,121,2],[122,1,122,2],[121,3,121,5],[122,3,122,5],[121,6,121,8],[122,6,122,8],[121,9,121,11],[122,9,122,11],[121,12,121,14],[122,12,122,14],[123,1,123,2],[124,1,124,2],[123,3,123,5],[124,3,124,5],[123,6,123,8],[124,6,124,8],[123,9,123,11],[124,9,124,11],[123,12,123,14],[124,12,124,14],[125,1,125,2],[126,1,126,2],[125,3,125,5],[126,3,126,5],[125,6,125,8],[126,6,126,8],[125,9,125,11],[126,9,126,11],[125,12,125,14],[126,12,126,14],[127,1,127,2],[128,1,128,2],[127,3,127,5],[128,3,128,5],[127,6,127,8],[128,6,128,8],[127,9,127,11],[128,9,128,11],[127,12,127,14],[128,12,128,14],[129,1,129,2],[130,1,130,2],[129,3,129,5],[130,3,130,5],[129,6,129,8],[130,6,130,8],[129,9,129,11],[130,9,130,11],[129,12,129,14],[130,12,130,14],[131,1,131,2],[132,1,132,2],[131,3,131,5],[132,3,132,5],[131,6,131,8],[132,6,132,8],[131,9,131,11],[132,9,132,11],[131,12,131,14],[132,12,132,14],[133,1,133,2],[134,1,134,2],[133,3,133,5],[134,3,134,5],[133,6,133,8],[134,6,134,8],[133,9,133,11],[134,9,134,11],[133,12,133,14],[134,12,134,14],[135,1,135,2],[136,1,136,2],[135,3,135,5],[136,3,136,5],[135,6,135,8],[136,6,136,8],[135,9,135,11],[136,9,136,11],[135,12,135,14],[136,12,136,14],[137,1,137,2],[138,1,138,2],[137,3,137,5],[138,3,138,5],[137,6,137,8],[138,6,138,8],[137,9,137,11],[138,9,138,11],[137,12,137,14],[138,12,138,14],[139,1,139,2],[140,1,140,2],[139,3,139,5],[140,3,140,5],[139,6,139,8],[140,6,140,8],[139,9,139,11],[140,9,140,11],[139,12,139,14],[140,12,140,14],[141,1,141,2],[142,1,142,2],[141,3,141,5],[142,3,142,5],[141,6,141,8],[142,6,142,8],[141,9,141,11],[142,9,142,11],[141,12,141,14],[142,12,142,14],[146,6,146,8],[145,9,145,11],[146,9,146,11],[145,12,145,14],[146,12,146,14],[143,1,143,2],[144,1,144,2],[143,3,143,5],[144,3,144,5],[143,6,143,8],[144,6,144,8],[143,9,143,11],[144,9,144,11],[143,12,143,14],[144,12,144,14],[169,1,169,2],[148,1,148,2],[149,1,149,2],[154,1,154,2],[170,1,170,2],[171,1,171,2],[170,9,170,11],[171,9,171,11],[158,6,158,8],[157,9,157,11],[158,9,158,11],[164,1,164,2],[161,1,161,2],[162,1,162,2],[161,3,161,5],[162,3,162,5],[163,3,163,5],[164,3,164,5],[161,6,161,8],[162,6,162,8],[163,6,163,8],[165,3,165,5],[166,3,166,5],[167,3,167,5],[172,1,172,2],[173,1,173,2],[173,6,173,8],[172,9,172,11],[173,9,173,11],[172,12,172,14],[173,12,173,14],[174,1,174,2],[175,1,175,2],[174,3,174,5],[175,3,175,5],[174,6,174,8],[175,6,175,8],[174,9,174,11],[175,9,175,11],[174,12,174,14],[175,12,175,14],[176,1,176,2],[177,1,177,2],[176,3,176,5],[177,3,177,5],[176,6,176,8],[177,6,177,8],[176,9,176,11],[177,9,177,11],[176,12,176,14],[177,12,177,14],[181,1,181,2],[178,1,178,2],[179,1,179,2],[178,3,178,5],[179,3,179,5],[180,3,180,5],[181,3,181,5],[178,6,178,8],[179,6,179,8],[183,1,183,2],[182,3,182,5],[183,3,183,5],[184,3,184,5],[185,3,185,5],[186,3,186,5],[187,3,187,5],[187,9,187,11],[183,6,183,8],[184,6,184,8],[185,6,185,8],[186,6,186,8],[187,6,187,8],[150,1,150,2],[182,1,182,2],[151,1,151,2],[152,1,152,2],[153,1,153,2],[180,1,180,2],[190,13,190,14],[189,1,189,2],[185,1,185,2],[184,1,184,2],[188,1,188,2],[186,1,186,2],[155,1,155,2],[156,1,156,2],[156,3,156,5],[156,6,156,8],[156,9,156,11],[156,12,156,14],[157,1,157,2],[158,1,158,2],[157,3,157,5],[158,3,158,5],[157,6,157,8],[187,1,187,2],[2,16,4,18],[167,1,167,2],[168,1,168,2],[165,1,165,2],[166,1,166,2],[163,1,163,2],[157,12,157,14],[158,12,158,14],[159,1,159,2],[160,1,160,2],[159,3,159,5],[160,3,160,5],[159,6,159,8],[160,6,160,8],[159,9,159,11],[160,9,160,11],[159,12,159,14],[160,12,160,14],[147,1,147,2],[145,1,145,2],[146,1,146,2],[145,3,145,5],[146,3,146,5],[145,6,145,8]]}
["Missouri Department of Transportation"]
["DBE Identification Submittal Form "]
[]
["Contract ID:",null,null,null,null,null,null,null,"Job Number:"]
[]
["Route:",null,null,null,null,null,null,null,"County:"]
[]
["Prime Contractor:",null,null,null,null,null,null,null,"Contract Amount:"]
{"$rows_left_out":187}
{"sheet":"Printed_Form","index":2,"n_rows":227,"n_cols":16,"rows_kept":227,"cut":false,"hidden":false,"merged":[[224,1,224,6],[224,8,224,10],[225,1,225,6],[226,1,226,6],[226,13,226,15],[221,3,221,5],[221,6,221,8],[221,9,221,11],[221,12,221,14],[222,3,222,5],[222,6,222,8],[222,9,222,11],[222,12,222,14],[110,6,110,8],[110,9,110,11],[110,12,110,14],[78,3,78,5],[78,6,78,8],[169,1,169,6],[170,1,170,6],[223,1,223,6],[223,8,223,10],[223,12,223,13],[220,3,220,5],[220,6,220,8],[220,9,220,11],[220,12,220,14],[171,0,171,1],[171,2,171,6],[108,6,108,8],[108,9,108,11],[108,12,108,14],[109,3,109,5],[109,6,109,8],[218,3,218,5],[218,6,218,8],[218,9,218,11],[58,13,58,15],[114,13,114,15],[170,13,170,15],[58,1,58,6],[111,1,111,6],[111,8,111,10],[111,12,111,13],[112,1,112,6],[112,8,112,10],[113,1,113,6],[114,1,114,6],[167,1,167,6],[167,8,167,10],[167,12,167,13],[168,1,168,6],[168,8,168,10],[109,9,109,11],[109,12,109,14],[110,3,110,5],[78,9,78,11],[78,12,78,14],[79,3,79,5],[79,6,79,8],[79,9,79,11],[218,12,218,14],[219,3,219,5],[219,6,219,8],[219,9,219,11],[219,12,219,14],[215,9,215,11],[215,12,215,14],[216,3,216,5],[216,6,216,8],[216,9,216,11],[216,12,216,14],[217,3,217,5],[217,6,217,8],[217,9,217,11],[217,12,217,14],[79,12,79,14],[80,3,80,5],[80,6,80,8],[80,9,80,11],[80,12,80,14],[38,1,39,2],[64,1,65,2],[64,3,65,5],[64,6,65,8],[64,9,65,11],[64,12,65,14],[55,1,55,6],[56,1,56,6],[57,1,57,6],[55,12,55,13],[55,8,55,10],[56,8,56,10],[51,6,51,8],[51,9,51,11],[51,12,51,14],[52,6,52,8],[52,9,52,11],[52,12,52,14],[53,6,53,8],[53,9,53,11],[53,12,53,14],[48,12,48,14],[49,6,49,8],[49,9,49,11],[49,12,49,14],[50,6,50,8],[50,9,50,11],[50,12,50,14],[7,0,7,2],[7,8,7,10],[9,0,13,14],[15,0,15,14],[17,0,18,14],[20,0,20,1],[20,2,20,6],[20,8,20,9],[21,10,21,14],[20,10,20,14],[7,11,7,14],[23,0,23,10],[23,11,23,14],[7,3,7,6],[6,17,8,19],[109,1,109,2],[110,1,110,2],[107,1,107,2],[108,1,108,2],[105,1,105,2],[106,1,106,2],[105,3,105,5],[105,6,105,8],[105,9,105,11],[105,12,105,14],[106,3,106,5],[106,6,106,8],[106,9,106,11],[106,12,106,14],[107,3,107,5],[107,6,107,8],[107,9,107,11],[107,12,107,14],[108,3,108,5],[103,1,103,2],[104,1,104,2],[103,3,103,5],[103,6,103,8],[103,9,103,11],[103,12,103,14],[104,3,104,5],[104,6,104,8],[104,9,104,11],[104,12,104,14],[101,1,101,2],[102,1,102,2],[101,3,101,5],[101,6,101,8],[101,9,101,11],[101,12,101,14],[102,3,102,5],[102,6,102,8],[102,9,102,11],[102,12,102,14],[99,1,99,2],[100,1,100,2],[99,3,99,5],[99,6,99,8],[99,9,99,11],[99,12,99,14],[100,3,100,5],[100,6,100,8],[100,9,100,11],[100,12,100,14],[97,1,97,2],[98,1,98,2],[97,3,97,5],[97,6,97,8],[97,9,97,11],[97,12,97,14],[98,3,98,5],[98,6,98,8],[98,9,98,11],[98,12,98,14],[95,1,95,2],[96,1,96,2],[95,3,95,5],[95,6,95,8],[95,9,95,11],[95,12,95,14],[96,3,96,5],[96,6,96,8],[96,9,96,11],[96,12,96,14],[93,1,93,2],[94,1,94,2],[93,3,93,5],[93,6,93,8],[93,9,93,11],[93,12,93,14],[94,3,94,5],[94,6,94,8],[94,9,94,11],[94,12,94,14],[91,1,91,2],[92,1,92,2],[91,3,91,5],[91,6,91,8],[91,9,91,11],[91,12,91,14],[92,3,92,5],[92,6,92,8],[92,9,92,11],[92,12,92,14],[89,1,89,2],[90,1,90,2],[89,3,89,5],[89,6,89,8],[89,9,89,11],[89,12,89,14],[90,3,90,5],[90,6,90,8],[90,9,90,11],[90,12,90,14],[87,1,87,2],[88,1,88,2],[87,3,87,5],[87,6,87,8],[87,9,87,11],[87,12,87,14],[88,3,88,5],[88,6,88,8],[88,9,88,11],[88,12,88,14],[85,1,85,2],[86,1,86,2],[85,3,85,5],[85,6,85,8],[85,9,85,11],[85,12,85,14],[86,3,86,5],[86,6,86,8],[86,9,86,11],[86,12,86,14],[83,1,83,2],[84,1,84,2],[83,3,83,5],[83,6,83,8],[83,9,83,11],[83,12,83,14],[84,3,84,5],[84,6,84,8],[84,9,84,11],[84,12,84,14],[80,1,80,2],[59,0,59,1],[59,2,59,6],[59,10,59,14],[61,3,61,12],[78,1,78,2],[79,1,79,2],[76,1,76,2],[81,1,81,2],[77,1,77,2],[76,3,76,5],[76,6,76,8],[76,9,76,11],[76,12,76,14],[77,3,77,5],[77,6,77,8],[77,9,77,11],[77,12,77,14],[74,1,74,2],[75,1,75,2],[74,3,74,5],[74,6,74,8],[74,9,74,11],[74,12,74,14],[82,1,82,2],[81,3,81,5],[81,6,81,8],[81,9,81,11],[81,12,81,14],[82,3,82,5],[82,6,82,8],[82,9,82,11],[82,12,82,14],[75,3,75,5],[75,6,75,8],[75,9,75,11],[75,12,75,14],[72,1,72,2],[73,1,73,2],[72,3,72,5],[72,6,72,8],[72,9,72,11],[72,12,72,14],[73,3,73,5],[73,6,73,8],[73,9,73,11],[73,12,73,14],[70,1,70,2],[71,1,71,2],[70,3,70,5],[70,6,70,8],[70,9,70,11],[70,12,70,14],[71,3,71,5],[71,6,71,8],[71,9,71,11],[71,12,71,14],[68,1,68,2],[69,1,69,2],[68,3,68,5],[68,6,68,8],[68,9,68,11],[68,12,68,14],[69,3,69,5],[69,6,69,8],[69,9,69,11],[69,12,69,14],[66,1,66,2],[67,1,67,2],[66,3,66,5],[66,6,66,8],[66,9,66,11],[66,12,66,14],[67,3,67,5],[67,6,67,8],[67,9,67,11],[67,12,67,14],[24,1,24,4],[24,9,24,13],[26,1,28,6],[29,1,29,6],[31,1,33,6],[37,1,37,14],[26,9,34,14],[51,1,51,2],[52,1,52,2],[38,3,39,5],[38,6,39,8],[38,12,39,14],[38,9,39,11],[41,6,41,8],[41,9,41,11],[41,12,41,14],[42,6,42,8],[42,9,42,11],[42,12,42,14],[50,3,50,5],[51,3,51,5],[52,3,52,5],[40,6,40,8],[40,9,40,11],[63,1,63,14],[48,1,48,2],[49,1,49,2],[45,3,45,5],[46,3,46,5],[47,3,47,5],[48,3,48,5],[49,3,49,5],[45,6,45,8],[45,9,45,11],[45,1,45,2],[46,1,46,2],[47,1,47,2],[53,1,53,2],[54,1,54,2],[54,6,54,8],[54,9,54,11],[54,12,54,14],[53,3,53,5],[54,3,54,5],[48,6,48,8],[48,9,48,11],[45,12,45,14],[46,6,46,8],[50,1,50,2],[40,3,40,5],[41,3,41,5],[42,3,42,5],[43,3,43,5],[44,3,44,5],[44,9,44,11],[44,12,44,14],[40,1,40,2],[41,1,41,2],[42,1,42,2],[43,1,43,2],[44,1,44,2],[40,12,40,14],[43,6,43,8],[43,9,43,11],[43,12,43,14],[44,6,44,8],[46,9,46,11],[46,12,46,14],[47,6,47,8],[47,9,47,11],[47,12,47,14],[117,3,117,12],[0,0,0,15],[1,0,1,15],[19,0,19,14],[3,10,3,14],[5,10,5,14],[119,1,119,14],[120,1,121,2],[120,3,121,5],[120,6,121,8],[120,9,121,11],[120,12,121,14],[3,7,3,9],[59,7,59,9],[115,7,115,9],[3,0,3,1],[5,0,5,1],[3,2,3,6],[5,2,5,6],[5,8,5,9],[34,1,34,6],[115,0,115,1],[115,2,115,6],[115,10,115,14],[122,1,122,2],[123,1,123,2],[122,3,122,5],[122,6,122,8],[122,9,122,11],[122,12,122,14],[123,3,123,5],[123,6,123,8],[123,9,123,11],[123,12,123,14],[124,1,124,2],[125,1,125,2],[124,3,124,5],[124,6,124,8],[124,9,124,11],[124,12,124,14],[125,3,125,5],[125,6,125,8],[125,9,125,11],[125,12,125,14],[126,1,126,2],[127,1,127,2],[126,3,126,5],[126,6,126,8],[126,9,126,11],[126,12,126,14],[127,3,127,5],[127,6,127,8],[127,9,127,11],[127,12,127,14],[128,1,128,2],[129,1,129,2],[128,3,128,5],[128,6,128,8],[128,9,128,11],[128,12,128,14],[129,3,129,5],[129,6,129,8],[129,9,129,11],[129,12,129,14],[130,1,130,2],[131,1,131,2],[130,3,130,5],[130,6,130,8],[130,9,130,11],[130,12,130,14],[131,3,131,5],[131,6,131,8],[131,9,131,11],[131,12,131,14],[132,1,132,2],[133,1,133,2],[132,3,132,5],[132,6,132,8],[132,9,132,11],[132,12,132,14],[133,3,133,5],[133,6,133,8],[133,9,133,11],[133,12,133,14],[134,1,134,2],[135,1,135,2],[134,3,134,5],[134,6,134,8],[134,9,134,11],[134,12,134,14],[135,3,135,5],[135,6,135,8],[135,9,135,11],[135,12,135,14],[136,1,136,2],[137,1,137,2],[136,3,136,5],[136,6,136,8],[136,9,136,11],[136,12,136,14],[137,3,137,5],[137,6,137,8],[137,9,137,11],[137,12,137,14],[138,1,138,2],[139,1,139,2],[138,3,138,5],[138,6,138,8],[138,9,138,11],[138,12,138,14],[139,3,139,5],[139,6,139,8],[139,9,139,11],[139,12,139,14],[140,1,140,2],[141,1,141,2],[140,3,140,5],[140,6,140,8],[140,9,140,11],[140,12,140,14],[141,3,141,5],[141,6,141,8],[141,9,141,11],[141,12,141,14],[142,1,142,2],[143,1,143,2],[142,3,142,5],[142,6,142,8],[142,9,142,11],[142,12,142,14],[143,3,143,5],[143,6,143,8],[143,9,143,11],[143,12,143,14],[144,1,144,2],[145,1,145,2],[144,3,144,5],[144,6,144,8],[144,9,144,11],[144,12,144,14],[145,3,145,5],[145,6,145,8],[145,9,145,11],[145,12,145,14],[146,1,146,2],[147,1,147,2],[146,3,146,5],[146,6,146,8],[146,9,146,11],[146,12,146,14],[147,3,147,5],[147,6,147,8],[147,9,147,11],[147,12,147,14],[148,1,148,2],[149,1,149,2],[148,3,148,5],[148,6,148,8],[148,9,148,11],[148,12,148,14],[149,3,149,5],[149,6,149,8],[149,9,149,11],[149,12,149,14],[150,1,150,2],[151,1,151,2],[150,3,150,5],[150,6,150,8],[150,9,150,11],[150,12,150,14],[151,3,151,5],[151,6,151,8],[151,9,151,11],[151,12,151,14],[152,1,152,2],[153,1,153,2],[152,3,152,5],[152,6,152,8],[152,9,152,11],[152,12,152,14],[153,3,153,5],[153,6,153,8],[153,9,153,11],[153,12,153,14],[154,1,154,2],[155,1,155,2],[154,3,154,5],[154,6,154,8],[154,9,154,11],[154,12,154,14],[155,3,155,5],[155,6,155,8],[155,9,155,11],[155,12,155,14],[156,1,156,2],[157,1,157,2],[156,3,156,5],[156,6,156,8],[156,9,156,11],[156,12,156,14],[157,3,157,5],[157,6,157,8],[157,9,157,11],[157,12,157,14],[158,1,158,2],[159,1,159,2],[158,3,158,5],[158,6,158,8],[158,9,158,11],[158,12,158,14],[159,3,159,5],[159,6,159,8],[159,9,159,11],[159,12,159,14],[160,1,160,2],[161,1,161,2],[160,3,160,5],[160,6,160,8],[160,9,160,11],[160,12,160,14],[161,3,161,5],[161,6,161,8],[161,9,161,11],[161,12,161,14],[162,1,162,2],[163,1,163,2],[162,3,162,5],[162,6,162,8],[162,9,162,11],[162,12,162,14],[163,3,163,5],[163,6,163,8],[163,9,163,11],[163,12,163,14],[164,1,164,2],[165,1,165,2],[164,3,164,5],[164,6,164,8],[164,9,164,11],[164,12,164,14],[165,3,165,5],[165,6,165,8],[165,9,165,11],[165,12,165,14],[171,10,171,14],[173,3,173,12],[166,1,166,2],[166,3,166,5],[166,6,166,8],[166,9,166,11],[166,12,166,14],[175,1,175,14],[176,1,177,2],[176,3,177,5],[176,6,177,8],[176,9,177,11],[176,12,177,14],[178,1,178,2],[179,1,179,2],[178,3,178,5],[178,6,178,8],[178,9,178,11],[178,12,178,14],[179,3,179,5],[179,6,179,8],[179,9,179,11],[179,12,179,14],[180,1,180,2],[181,1,181,2],[180,3,180,5],[180,6,180,8],[180,9,180,11],[180,12,180,14],[181,3,181,5],[181,6,181,8],[181,9,181,11],[181,12,181,14],[182,1,182,2],[183,1,183,2],[182,3,182,5],[182,6,182,8],[182,9,182,11],[182,12,182,14],[183,3,183,5],[183,6,183,8],[183,9,183,11],[183,12,183,14],[184,1,184,2],[185,1,185,2],[184,3,184,5],[184,6,184,8],[184,9,184,11],[184,12,184,14],[185,3,185,5],[185,6,185,8],[185,9,185,11],[185,12,185,14],[186,1,186,2],[187,1,187,2],[186,3,186,5],[186,6,186,8],[186,9,186,11],[186,12,186,14],[187,3,187,5],[187,6,187,8],[187,9,187,11],[187,12,187,14],[188,1,188,2],[189,1,189,2],[188,3,188,5],[188,6,188,8],[188,9,188,11],[188,12,188,14],[189,3,189,5],[189,6,189,8],[189,9,189,11],[189,12,189,14],[190,1,190,2],[191,1,191,2],[190,3,190,5],[190,6,190,8],[190,9,190,11],[190,12,190,14],[191,3,191,5],[191,6,191,8],[191,9,191,11],[191,12,191,14],[192,1,192,2],[193,1,193,2],[192,3,192,5],[192,6,192,8],[192,9,192,11],[192,12,192,14],[193,3,193,5],[193,6,193,8],[193,9,193,11],[193,12,193,14],[194,1,194,2],[195,1,195,2],[194,3,194,5],[194,6,194,8],[194,9,194,11],[194,12,194,14],[195,3,195,5],[195,6,195,8],[195,9,195,11],[195,12,195,14],[196,1,196,2],[197,1,197,2],[196,3,196,5],[196,6,196,8],[196,9,196,11],[196,12,196,14],[197,3,197,5],[197,6,197,8],[197,9,197,11],[197,12,197,14],[198,1,198,2],[199,1,199,2],[198,3,198,5],[198,6,198,8],[198,9,198,11],[198,12,198,14],[199,3,199,5],[199,6,199,8],[199,9,199,11],[199,12,199,14],[200,1,200,2],[201,1,201,2],[200,3,200,5],[200,6,200,8],[200,9,200,11],[200,12,200,14],[201,3,201,5],[201,6,201,8],[201,9,201,11],[201,12,201,14],[203,1,203,2],[202,3,202,5],[202,6,202,8],[202,9,202,11],[202,12,202,14],[203,3,203,5],[203,6,203,8],[203,9,203,11],[203,12,203,14],[206,12,206,14],[207,3,207,5],[207,6,207,8],[207,9,207,11],[207,12,207,14],[204,1,204,2],[205,1,205,2],[204,3,204,5],[204,6,204,8],[204,9,204,11],[204,12,204,14],[205,3,205,5],[205,6,205,8],[205,9,205,11],[205,12,205,14],[210,12,210,14],[211,3,211,5],[211,6,211,8],[211,9,211,11],[211,12,211,14],[208,1,208,2],[209,1,209,2],[208,3,208,5],[208,6,208,8],[208,9,208,11],[208,12,208,14],[209,3,209,5],[209,6,209,8],[209,9,209,11],[209,12,209,14],[214,12,214,14],[215,3,215,5],[215,6,215,8],[212,1,212,2],[213,1,213,2],[212,3,212,5],[212,6,212,8],[212,9,212,11],[212,12,212,14],[213,3,213,5],[213,6,213,8],[213,9,213,11],[213,12,213,14],[220,1,220,2],[221,1,221,2],[218,1,218,2],[219,1,219,2],[171,7,171,9],[222,1,222,2],[216,1,216,2],[217,1,217,2],[214,1,214,2],[215,1,215,2],[214,3,214,5],[214,6,214,8],[214,9,214,11],[210,1,210,2],[211,1,211,2],[210,3,210,5],[210,6,210,8],[210,9,210,11],[206,1,206,2],[207,1,207,2],[206,3,206,5],[206,6,206,8],[206,9,206,11],[202,1,202,2]]}
["Missouri Department of Transportation"]
["DBE Identification Submittal Form"]
[]
["Contract ID:",null,{"$f":"IF('Data entry'!C4:G4=0,\" \",'Data entry'!C4:G4)","v":" "},null,null,null,null,"Job Number:",null,null,{"$f":"IF('Data entry'!K4:O4=0,\" \",'Data entry'!K4:O4)","v":" "}]
[]
["Route:",null,{"$f":"IF('Data entry'!C6:G6=0,\" \",'Data entry'!C6:G6)","v":" "},null,null,null,null,null,"County:",null,{"$f":"IF('Data entry'!K6:O6=0,\" \",'Data entry'!K6:O6)","v":" "}]
[]
["Prime Contractor:",null,null,{"$f":"IF('Data entry'!D8:H8=0,\" \",'Data entry'!D8:H8)","v":" "},null,null,null,null,"Contract Amount:",null,null,{"$f":"IF('Data entry'!L8:O8=0,\" \",'Data entry'!L8:O8)","v":" "}]
{"$rows_left_out":219}