{"text_format":"1","workbook":"xlsx","n_sheets":6,"sheets":["Instructions","Contract Data","Work Order","Asphalt","Class C Partial","GIS Data"],"not_rendered":{"charts":0,"images":1,"macros":1,"external_links":0,"defined_names":2,"comments":0,"pivot_tables":0},"unopened":[],"bounds":{"document_bytes":16777216,"sheet_cells":100000,"rows_first":2000,"rows_last":500,"rows_between":2000,"halvings":0,"cell_chars":16384,"cell_head_chars":4096},"cells_cut":0,"cells_raw":0,"read":"whole","date_system":"1900"}

{"sheet":"Instructions","index":0,"n_rows":34,"n_cols":1,"rows_kept":34,"cut":false,"hidden":false,"merged":[]}
["(If using spreadshseet tab for the first time, Click on the \"Contract Data\" Tab to fill out specific contract data)"]
["Remove and/or fill out any of the highlighted areas in order to set this up for YOUR contract.  You may need to scroll over to column G to see this information."]
[]
[]
["(If repair quantities and dimensions are already known, proceed to Select the Work Order Tab instructions)"]
[]
[]
["Select the tab most appropriate for the repair to be performed"]
[]
["Enter the number of mobilizations (for asphalt repairs, also choose the correct type from the adjacent dropdown menu)"]
[]
["Input the repair dimensions (length, width, depth,)"]
[]
["When appropriate, check the boxes associated with the characteristics of the repair"]
[]
["Choose the desired traffic control devices using the dropdown menus and enter the correct quantity"]
[]
[]
["Select the Work Order Tab"]
[]
{"$rows_left_out":15}
{"sheet":"Contract Data","index":1,"n_rows":56,"n_cols":18,"rows_kept":56,"cut":false,"hidden":false,"merged":[]}
["Do not change these items","Fixed \nPrice","Item\nNumber",null,"Unit",null,"Enter Contract Bid Factor Here",null,null,null,null,null,"Enter Project Job Number Here","Enter Contractor and Contract ID Here",null,null,null,""]
["TRAFFIC CONTROL ITEMS",null,null,null,null,null,"Adjustment Factor",null,"Each"]
["MISC. ADDITIONAL CONSTRUCTION SIGNS",3,6161005,null,"SF"]
["MISC. ADDITIONAL CHANNELIZER (TRIMLINE)",9,6161025,null,"EA"]
["MISC. ADDITIONAL TYPE III MOVEABLE BARRICADE ",75,6161030,null,"EA"]
["MISC. ADDITIONAL DIRECTIONAL INDICATOR BARRICADE",18.75,6161033,null,"EA"]
["MISC. ADDITIONAL FLASHING ARROW PANEL",390,6161040,null,"EA"]
["MISC. SEQUENTIAL FLASHING WARNING LIGHT",50,6161055,null,"EA"]
["MISC. ADDITIONAL CMS (CONTRACTOR FURNISHED/RETAINED) ",1200,6161098,null,"EA"]
["SINGLE LANE CLOSURE ",3000,6169902,null,"EA"]
["DOUBLE LANE CLOSURE ",3900,6169902,null,"EA"]
["INTERIOR LANE CLOSURE",3900,6169902,null,"EA",null,"Fill in Maintenance Superintendents for your District - populates cell I14 of Work Order spreadsheet"]
["TRIPLE LANE CLOSURE",4500,6169902,null,"EA"]
["RAMP CLOSURE ",1800,6169902,null,"EA"]
["TEMPORARY TRAFFIC CONTROL SINGLE LANE SHIFT",1000,6169902,null,"EA",null,null,null,"Direction (N, S, E, W)"]
["MISC. 1-LANE 2-WAY OPERATION W/ FLAGGERS",3000,6169902,null,"EA",null,null,null,null,null,"SELECT"]
["MISC. ADDITIONAL TRUCK MOUNTED ATTENUATOR (TMA)",750,6169902,null,"EA",null,"Used in picklist - Do Not Delete",null,null,null,"N"]
[null,null,null,null,null,null,"Yes",null,null,null,"S"]
["ASPHALT PAVEMENT ITEMS",null,null,null,null,null,"No",null,null,null,"E"]
["Shoulder Mix (15-100 tons) (Over 9 feet wide)",85,4019910,2.4569999999999999,"TONS",null,"Enter Counties Here",null,null,null,"W"]
{"$rows_left_out":37}
{"sheet":"Work Order","index":2,"n_rows":75,"n_cols":11,"rows_kept":75,"cut":false,"hidden":false,"merged":[[42,1,42,2],[43,1,43,2],[51,1,51,2],[44,1,44,2],[45,1,45,2],[48,1,48,2],[49,1,49,2],[50,1,50,2],[6,1,6,2],[15,1,15,2],[13,6,13,7],[14,6,14,7],[41,1,41,2],[34,1,34,2],[17,1,17,2],[38,1,38,2],[39,1,39,2],[40,1,40,2],[37,1,37,2],[27,1,27,2],[28,1,28,2],[29,1,29,2],[32,1,32,2],[33,1,33,2],[16,1,16,2],[18,1,18,3],[19,1,21,9],[23,1,23,2],[26,1,26,2],[10,8,10,9],[14,8,14,9],[11,1,11,2],[12,1,12,2],[13,1,13,2],[14,1,14,2],[10,1,10,2],[11,8,11,9],[13,8,13,9],[10,6,10,7],[5,1,5,9],[11,6,11,7],[9,1,9,2],[0,1,0,9],[1,1,1,9],[2,1,2,9],[3,1,3,9],[4,1,4,9],[6,6,6,7],[7,6,7,7],[8,6,8,7],[8,1,8,2],[7,1,7,2],[6,8,6,9],[7,8,7,9],[8,8,8,9],[67,5,67,7],[54,1,54,9],[69,2,69,3],[69,4,69,6],[69,7,69,9],[61,2,61,3],[62,2,62,3],[63,2,63,3],[64,2,64,3],[60,1,60,2],[57,5,57,6],[58,5,58,6],[70,1,71,1],[70,2,70,3],[70,4,70,6],[70,7,70,9],[71,2,71,3],[71,4,71,6],[71,7,71,9],[74,2,74,9],[72,1,73,1],[72,2,72,3],[72,4,72,6],[72,7,72,9],[73,2,73,3],[73,4,73,6],[73,7,73,9]]}
[null,"Missouri Department of Transportation"]
[null,"2023 Asphalt Pavement Repair Job Order",null,false]
[null,{"$f":"'Contract Data'!M2","v":0}]
[null,{"$f":"IF(B3>0,VLOOKUP(B3,'Contract Data'!M2:N6,2,FALSE),\"\")","v":""}]
[]
[null,"  Actual amount paid to contractor will be determined by field measured quantities."]
[null,"Work Order Number",null,null,null,null,"Confirm Receipt"]
[null,"Work Order Issued",null,null,null,null,"Start of Repair Work"]
[null,"Notice to Proceed",null,null,null,null,"Repairs Completed"]
[null,"To be completed by"]
[null,"Acceptance for Maintenance",null,null,null,null,"Mix ID"]
[null,"Route",null,null,"`",null,"Plant Location"]
[null,"County","County"]
[null,"Direction","Direction",null,null,null,"Maintenance Supervisor"]
[null,"Milemarker","Mile Marker",null,null,null," WZ Law Enforcement?"]
[null,"Working Hour Restrictions"]
[null,null,null,null,null,null,null,null,"Daytime","Nighttime"]
[null,null,null,null,null,null,null,null,false,false]
[null,"Location and Description of Repair(s):  "]
[null,"Asphalt Pavement Repair:"]
{"$rows_left_out":56}
{"sheet":"Asphalt","index":3,"n_rows":58,"n_cols":25,"rows_kept":58,"cut":false,"hidden":false,"merged":[[1,5,1,7]]}
[null,null,null,null,null,null,null,"JMF Gmm",2.44]
[null,null,null,null,null,"Anticipated Density:",null,null,92]
[]
["Log Mile","Lane (Driving/Passing)","Mill \n(in)","Replace \n(in)","Tack \nCoat","Length","Width","Milling \nper SY","Area SF","Area SY","Tack Coat \nTotal","Mix Type","Tons","Price",null,"Quantity","Traffic Control","Price","TC Total",null,"Quantity","Mobilization","Price","Mob Total"]
[null,null,null,null,null,null,null,{"$f":"IF(AND(0<C5,C5<2),'Contract Data'!$B$47*J5,IF(OR(AND(2<C5,C5<4),C5=2,C5=4),'Contract Data'!$B$48*J5,IF(OR(AND(4<C5,C5<6),C5=6),'Contract Data'!$B$49*J5,IF(C5>6,'Contract Data'!$B$50*J5,0))))","v":0},{"$f":"F5*G5","v":0},{"$f":"I5/9","v":0},{"$f":"IF(E5=TRUE,0.1*J5,0)","v":0},null,{"$f":"Asphalt!$I$2/100*(Asphalt!$I$1*62.4/2000)*(Asphalt!I5*Asphalt!D5/12)","v":0},{"$f":"IF(L5>0,VLOOKUP(L5,'Contract Data'!$A$20:$B$43,2,FALSE)*M5,0)","v":0},null,null,null,{"$f":"IF(Q5>0,VLOOKUP(Q5,'Contract Data'!$A$57:$B$72,2,FALSE),)","v":0},{"$f":"R5*P5","v":0},null,null,null,{"$f":"IF(V5>0,VLOOKUP(V5,'Contract Data'!$A$52:$B$56,2,FALSE),0)","v":0},{"$f":"W5*U5","v":0}]
[null,null,null,null,null,null,null,{"$f":"IF(AND(0<C6,C6<2),'Contract Data'!$B$47*J6,IF(OR(AND(2<C6,C6<4),C6=2,C6=4),'Contract Data'!$B$48*J6,IF(OR(AND(4<C6,C6<6),C6=6),'Contract Data'!$B$49*J6,IF(C6>6,'Contract Data'!$B$50*J6,0))))","v":0},0,{"$f":"I6/9","v":0},{"$f":"IF(E6=TRUE,0.1*J6,0)","v":0},null,{"$f":"Asphalt!$I$2/100*(Asphalt!$I$1*62.4/2000)*(Asphalt!I6*Asphalt!D6/12)","v":0},{"$f":"IF(L6>0,VLOOKUP(L6,'Contract Data'!$A$20:$B$43,2,FALSE)*M6,0)","v":0},null,null,null,{"$f":"IF(Q6>0,VLOOKUP(Q6,'Contract Data'!$A$57:$B$72,2,FALSE),)","v":0},{"$f":"R6*P6","v":0},null,null,null,{"$f":"IF(V6>0,VLOOKUP(V6,'Contract Data'!$A$52:$B$56,2,FALSE),0)","v":0},{"$f":"W6*U6","v":0}]
[null,null,null,null,false,null,null,{"$f":"IF(AND(0<C7,C7<2),'Contract Data'!$B$47*J7,IF(OR(AND(2<C7,C7<4),C7=2,C7=4),'Contract Data'!$B$48*J7,IF(OR(AND(4<C7,C7<6),C7=6),'Contract Data'!$B$49*J7,IF(C7>6,'Contract Data'!$B$50*J7,0))))","v":0},0,0,0,null,{"$f":"Asphalt!$I$2/100*(Asphalt!$I$1*62.4/2000)*(Asphalt!I7*Asphalt!D7/12)","v":0},{"$f":"IF(L7>0,VLOOKUP(L7,'Contract Data'!$A$20:$B$43,2,FALSE)*M7,0)","v":0},null,null,null,{"$f":"IF(Q7>0,VLOOKUP(Q7,'Contract Data'!$A$57:$B$72,2,FALSE),)","v":0},0,null,null,null,{"$f":"IF(V7>0,VLOOKUP(V7,'Contract Data'!$A$52:$B$56,2,FALSE),0)","v":0},0]
[null,null,null,null,false,null,null,{"$f":"IF(AND(0<C8,C8<2),'Contract Data'!$B$47*J8,IF(OR(AND(2<C8,C8<4),C8=2,C8=4),'Contract Data'!$B$48*J8,IF(OR(AND(4<C8,C8<6),C8=6),'Contract Data'!$B$49*J8,IF(C8>6,'Contract Data'!$B$50*J8,0))))","v":0},0,0,0,null,{"$f":"Asphalt!$I$2/100*(Asphalt!$I$1*62.4/2000)*(Asphalt!I8*Asphalt!D8/12)","v":0},{"$f":"IF(L8>0,VLOOKUP(L8,'Contract Data'!$A$20:$B$43,2,FALSE)*M8,0)","v":0},null,null,null,{"$f":"IF(Q8>0,VLOOKUP(Q8,'Contract Data'!$A$57:$B$72,2,FALSE),)","v":0},0]
[null,null,null,null,false,null,null,{"$f":"IF(AND(0<C9,C9<2),'Contract Data'!$B$47*J9,IF(OR(AND(2<C9,C9<4),C9=2,C9=4),'Contract Data'!$B$48*J9,IF(OR(AND(4<C9,C9<6),C9=6),'Contract Data'!$B$49*J9,IF(C9>6,'Contract Data'!$B$50*J9,0))))","v":0},0,0,0,null,{"$f":"Asphalt!$I$2/100*(Asphalt!$I$1*62.4/2000)*(Asphalt!I9*Asphalt!D9/12)","v":0},{"$f":"IF(L9>0,VLOOKUP(L9,'Contract Data'!$A$20:$B$43,2,FALSE)*M9,0)","v":0},null,null,null,{"$f":"IF(Q9>0,VLOOKUP(Q9,'Contract Data'!$A$57:$B$72,2,FALSE),)","v":0},0]
[null,null,null,null,false,null,null,{"$f":"IF(AND(0<C10,C10<2),'Contract Data'!$B$47*J10,IF(OR(AND(2<C10,C10<4),C10=2,C10=4),'Contract Data'!$B$48*J10,IF(OR(AND(4<C10,C10<6),C10=6),'Contract Data'!$B$49*J10,IF(C10>6,'Contract Data'!$B$50*J10,0))))","v":0},0,0,0,null,{"$f":"Asphalt!$I$2/100*(Asphalt!$I$1*62.4/2000)*(Asphalt!I10*Asphalt!D10/12)","v":0},{"$f":"IF(L10>0,VLOOKUP(L10,'Contract Data'!$A$20:$B$43,2,FALSE)*M10,0)","v":0},null,null,null,{"$f":"IF(Q10>0,VLOOKUP(Q10,'Contract Data'!$A$57:$B$72,2,FALSE),)","v":0},0]
[null,null,null,null,false,null,null,{"$f":"IF(AND(0<C11,C11<2),'Contract Data'!$B$47*J11,IF(OR(AND(2<C11,C11<4),C11=2,C11=4),'Contract Data'!$B$48*J11,IF(OR(AND(4<C11,C11<6),C11=6),'Contract Data'!$B$49*J11,IF(C11>6,'Contract Data'!$B$50*J11,0))))","v":0},0,0,0,null,{"$f":"Asphalt!$I$2/100*(Asphalt!$I$1*62.4/2000)*(Asphalt!I11*Asphalt!D11/12)","v":0},{"$f":"IF(L11>0,VLOOKUP(L11,'Contract Data'!$A$20:$B$43,2,FALSE)*M11,0)","v":0},null,null,null,{"$f":"IF(Q11>0,VLOOKUP(Q11,'Contract Data'!$A$57:$B$72,2,FALSE),)","v":0},0]
[null,null,null,null,false,null,null,{"$f":"IF(AND(0<C12,C12<2),'Contract Data'!$B$47*J12,IF(OR(AND(2<C12,C12<4),C12=2,C12=4),'Contract Data'!$B$48*J12,IF(OR(AND(4<C12,C12<6),C12=6),'Contract Data'!$B$49*J12,IF(C12>6,'Contract Data'!$B$50*J12,0))))","v":0},0,0,0,null,{"$f":"Asphalt!$I$2/100*(Asphalt!$I$1*62.4/2000)*(Asphalt!I12*Asphalt!D12/12)","v":0},{"$f":"IF(L12>0,VLOOKUP(L12,'Contract Data'!$A$20:$B$43,2,FALSE)*M12,0)","v":0},null,null,null,{"$f":"IF(Q12>0,VLOOKUP(Q12,'Contract Data'!$A$57:$B$72,2,FALSE),)","v":0},0]
[null,null,null,null,false,null,null,{"$f":"IF(AND(0<C13,C13<2),'Contract Data'!$B$47*J13,IF(OR(AND(2<C13,C13<4),C13=2,C13=4),'Contract Data'!$B$48*J13,IF(OR(AND(4<C13,C13<6),C13=6),'Contract Data'!$B$49*J13,IF(C13>6,'Contract Data'!$B$50*J13,0))))","v":0},0,0,0,null,{"$f":"Asphalt!$I$2/100*(Asphalt!$I$1*62.4/2000)*(Asphalt!I13*Asphalt!D13/12)","v":0},{"$f":"IF(L13>0,VLOOKUP(L13,'Contract Data'!$A$20:$B$43,2,FALSE)*M13,0)","v":0},null,null,null,{"$f":"IF(Q13>0,VLOOKUP(Q13,'Contract Data'!$A$57:$B$72,2,FALSE),)","v":0},0]
[null,null,null,null,false,null,null,{"$f":"IF(AND(0<C14,C14<2),'Contract Data'!$B$47*J14,IF(OR(AND(2<C14,C14<4),C14=2,C14=4),'Contract Data'!$B$48*J14,IF(OR(AND(4<C14,C14<6),C14=6),'Contract Data'!$B$49*J14,IF(C14>6,'Contract Data'!$B$50*J14,0))))","v":0},0,0,0,null,{"$f":"Asphalt!$I$2/100*(Asphalt!$I$1*62.4/2000)*(Asphalt!I14*Asphalt!D14/12)","v":0},{"$f":"IF(L14>0,VLOOKUP(L14,'Contract Data'!$A$20:$B$43,2,FALSE)*M14,0)","v":0},null,null,null,{"$f":"IF(Q14>0,VLOOKUP(Q14,'Contract Data'!$A$57:$B$72,2,FALSE),)","v":0},0]
[null,null,null,null,false,null,null,{"$f":"IF(AND(0<C15,C15<2),'Contract Data'!$B$47*J15,IF(OR(AND(2<C15,C15<4),C15=2,C15=4),'Contract Data'!$B$48*J15,IF(OR(AND(4<C15,C15<6),C15=6),'Contract Data'!$B$49*J15,IF(C15>6,'Contract Data'!$B$50*J15,0))))","v":0},0,0,0,null,{"$f":"Asphalt!$I$2/100*(Asphalt!$I$1*62.4/2000)*(Asphalt!I15*Asphalt!D15/12)","v":0},{"$f":"IF(L15>0,VLOOKUP(L15,'Contract Data'!$A$20:$B$43,2,FALSE)*M15,0)","v":0},null,null,null,{"$f":"IF(Q15>0,VLOOKUP(Q15,'Contract Data'!$A$57:$B$72,2,FALSE),)","v":0},0]
[null,null,null,null,false,null,null,{"$f":"IF(AND(0<C16,C16<2),'Contract Data'!$B$47*J16,IF(OR(AND(2<C16,C16<4),C16=2,C16=4),'Contract Data'!$B$48*J16,IF(OR(AND(4<C16,C16<6),C16=6),'Contract Data'!$B$49*J16,IF(C16>6,'Contract Data'!$B$50*J16,0))))","v":0},0,0,0,null,{"$f":"Asphalt!$I$2/100*(Asphalt!$I$1*62.4/2000)*(Asphalt!I16*Asphalt!D16/12)","v":0},{"$f":"IF(L16>0,VLOOKUP(L16,'Contract Data'!$A$20:$B$43,2,FALSE)*M16,0)","v":0},null,null,null,{"$f":"IF(Q16>0,VLOOKUP(Q16,'Contract Data'!$A$57:$B$72,2,FALSE),)","v":0},0]
[null,null,null,null,false,null,null,{"$f":"IF(AND(0<C17,C17<2),'Contract Data'!$B$47*J17,IF(OR(AND(2<C17,C17<4),C17=2,C17=4),'Contract Data'!$B$48*J17,IF(OR(AND(4<C17,C17<6),C17=6),'Contract Data'!$B$49*J17,IF(C17>6,'Contract Data'!$B$50*J17,0))))","v":0},0,0,0,null,{"$f":"Asphalt!$I$2/100*(Asphalt!$I$1*62.4/2000)*(Asphalt!I17*Asphalt!D17/12)","v":0},{"$f":"IF(L17>0,VLOOKUP(L17,'Contract Data'!$A$20:$B$43,2,FALSE)*M17,0)","v":0},null,null,null,{"$f":"IF(Q17>0,VLOOKUP(Q17,'Contract Data'!$A$57:$B$72,2,FALSE),)","v":0},0]
[null,null,null,null,false,null,null,{"$f":"IF(AND(0<C18,C18<2),'Contract Data'!$B$47*J18,IF(OR(AND(2<C18,C18<4),C18=2,C18=4),'Contract Data'!$B$48*J18,IF(OR(AND(4<C18,C18<6),C18=6),'Contract Data'!$B$49*J18,IF(C18>6,'Contract Data'!$B$50*J18,0))))","v":0},0,0,0,null,{"$f":"Asphalt!$I$2/100*(Asphalt!$I$1*62.4/2000)*(Asphalt!I18*Asphalt!D18/12)","v":0},{"$f":"IF(L18>0,VLOOKUP(L18,'Contract Data'!$A$20:$B$43,2,FALSE)*M18,0)","v":0},null,null,null,{"$f":"IF(Q18>0,VLOOKUP(Q18,'Contract Data'!$A$57:$B$72,2,FALSE),)","v":0},0]
[null,null,null,null,false,null,null,{"$f":"IF(AND(0<C19,C19<2),'Contract Data'!$B$47*J19,IF(OR(AND(2<C19,C19<4),C19=2,C19=4),'Contract Data'!$B$48*J19,IF(OR(AND(4<C19,C19<6),C19=6),'Contract Data'!$B$49*J19,IF(C19>6,'Contract Data'!$B$50*J19,0))))","v":0},0,0,0,null,{"$f":"Asphalt!$I$2/100*(Asphalt!$I$1*62.4/2000)*(Asphalt!I19*Asphalt!D19/12)","v":0},{"$f":"IF(L19>0,VLOOKUP(L19,'Contract Data'!$A$20:$B$43,2,FALSE)*M19,0)","v":0}]
[null,null,null,null,false,null,null,{"$f":"IF(AND(0<C20,C20<2),'Contract Data'!$B$47*J20,IF(OR(AND(2<C20,C20<4),C20=2,C20=4),'Contract Data'!$B$48*J20,IF(OR(AND(4<C20,C20<6),C20=6),'Contract Data'!$B$49*J20,IF(C20>6,'Contract Data'!$B$50*J20,0))))","v":0},0,0,0,null,{"$f":"Asphalt!$I$2/100*(Asphalt!$I$1*62.4/2000)*(Asphalt!I20*Asphalt!D20/12)","v":0},{"$f":"IF(L20>0,VLOOKUP(L20,'Contract Data'!$A$20:$B$43,2,FALSE)*M20,0)","v":0}]
{"$rows_left_out":39}
{"sheet":"Class C Partial","index":4,"n_rows":60,"n_cols":21,"rows_kept":60,"cut":false,"hidden":false,"merged":[]}
[]
[null,null,null,null,null,null,null,false,null,"Anticipated Density",92]
[]
["Log Mile","Lane (Driving/Passing)","Mill \n(in)","Replace\n(in)","Tack Coat","Length","Width","Sq Ft","Sq Yds of \nRemoval","Tons of \nMaterial","Tack Coat \nTotal","Quantity","Traffic Control","Price","TC Total",null,"Quantity","Mobilization","Price","Mob Total"]
[null,null,null,null,false,null,null,{"$f":"F5*G5","v":0},{"$f":"H5/9","v":0},{"$f":"$K$2/100*H5*D5/12*62.4/2000","v":0},{"$f":"IF(E5=TRUE,0.1*I5,0)","v":0},null,null,{"$f":"IF(M5>0,VLOOKUP(M5,'Contract Data'!$A$57:$B$72,2,FALSE),0)","v":0},{"$f":"L5*N5","v":0},null,null,null,{"$f":"IF(R5>0,VLOOKUP(R5,'Contract Data'!$A$52:$B$56,2,FALSE),0)","v":0},{"$f":"S5*Q5","v":0}]
[null,null,null,null,false,null,null,{"$f":"F6*G6","v":0},{"$f":"H6/9","v":0},{"$f":"$K$2/100*H6*D6/12*62.4/2000","v":0},{"$f":"IF(E6=TRUE,0.1*I6,0)","v":0},null,null,{"$f":"IF(M6>0,VLOOKUP(M6,'Contract Data'!$A$57:$B$72,2,FALSE),0)","v":0},{"$f":"L6*N6","v":0},null,null,null,{"$f":"IF(R6>0,VLOOKUP(R6,'Contract Data'!$A$52:$B$56,2,FALSE),0)","v":0},{"$f":"S6*Q6","v":0}]
[null,null,null,null,false,null,null,0,0,0,0,null,null,{"$f":"IF(M7>0,VLOOKUP(M7,'Contract Data'!$A$57:$B$72,2,FALSE),0)","v":0},0,null,null,null,{"$f":"IF(R7>0,VLOOKUP(R7,'Contract Data'!$A$52:$B$56,2,FALSE),0)","v":0},{"$f":"S7*Q7","v":0}]
[null,null,null,null,false,null,null,0,0,0,0,null,null,{"$f":"IF(M8>0,VLOOKUP(M8,'Contract Data'!$A$57:$B$72,2,FALSE),0)","v":0},0]
[null,null,null,null,false,null,null,0,0,0,0,null,null,{"$f":"IF(M9>0,VLOOKUP(M9,'Contract Data'!$A$57:$B$72,2,FALSE),0)","v":0},0]
[null,null,null,null,false,null,null,0,0,0,0,null,null,{"$f":"IF(M10>0,VLOOKUP(M10,'Contract Data'!$A$57:$B$72,2,FALSE),0)","v":0},0]
[null,null,null,null,false,null,null,0,0,0,0,null,null,{"$f":"IF(M11>0,VLOOKUP(M11,'Contract Data'!$A$57:$B$72,2,FALSE),0)","v":0},0]
[null,null,null,null,false,null,null,0,0,0,0,null,null,{"$f":"IF(M12>0,VLOOKUP(M12,'Contract Data'!$A$57:$B$72,2,FALSE),0)","v":0},0]
[null,null,null,null,false,null,null,0,0,0,0,null,null,{"$f":"IF(M13>0,VLOOKUP(M13,'Contract Data'!$A$57:$B$72,2,FALSE),0)","v":0},0]
[null,null,null,null,false,null,null,0,0,0,0,null,null,{"$f":"IF(M14>0,VLOOKUP(M14,'Contract Data'!$A$57:$B$72,2,FALSE),0)","v":0},0]
[null,null,null,null,false,null,null,0,0,0,0,null,null,{"$f":"IF(M15>0,VLOOKUP(M15,'Contract Data'!$A$57:$B$72,2,FALSE),0)","v":0},0]
[null,null,null,null,false,null,null,0,0,0,0,null,null,{"$f":"IF(M16>0,VLOOKUP(M16,'Contract Data'!$A$57:$B$72,2,FALSE),0)","v":0},0]
[null,null,null,null,false,null,null,0,0,0,0,null,null,{"$f":"IF(M17>0,VLOOKUP(M17,'Contract Data'!$A$57:$B$72,2,FALSE),0)","v":0},0]
[null,null,null,null,false,null,null,0,0,0,0]
[null,null,null,null,false,null,null,0,0,0,0]
[null,null,null,null,false,null,null,0,0,0,0]
{"$rows_left_out":41}
{"sheet":"GIS Data","index":5,"n_rows":28,"n_cols":5,"rows_kept":28,"cut":false,"hidden":false,"merged":[]}
[]
[null,"County:",null,null,"Contractor:"]
[]
[null,false,false,false,"Inspector:"]
[]
[null,"Route:",null,null,"Asphalt Supplier:"]
[]
[null,"Date:",null,null,"Base Rock Supplier:"]
[]
[null,"Lane #:",null,null,"Mix ID Used:"]
[]
[null,"MM:",null,null,"Final Cost of Repair:"]
[]
[null,"Direction:"]
[]
[null,"WO #:"]
[]
[]
[]
[null,null,"Milling Thickness"]
{"$rows_left_out":8}