{"text_format":"1","workbook":"xlsx","n_sheets":6,"sheets":["Cover Page","Structural Post Selector","Pipe Post Selector","Wood Post Selector","PSST Post Selector","Channel Post Selector"],"not_rendered":{"charts":0,"images":0,"macros":1,"external_links":0,"defined_names":17,"comments":2,"pivot_tables":0},"unopened":[],"bounds":{"document_bytes":16777216,"sheet_cells":100000,"rows_first":2000,"rows_last":500,"rows_between":2000,"halvings":0,"cell_chars":16384,"cell_head_chars":4096},"cells_cut":0,"cells_raw":0,"read":"whole","date_system":"1900"}

{"sheet":"Cover Page","index":0,"n_rows":26,"n_cols":6,"rows_kept":26,"cut":false,"hidden":false,"merged":[[13,3,13,5],[0,0,0,8]]}
["SIGN POST SELECTION GUIDE"]
[]
[]
[]
[null,null,"Post Selection Worksheets For:"]
[]
[null,null,null,"- Channel / Wood / PSST Posts"]
[null,null,null,"- Pipe Posts"]
[null,null,null,"- Structural Posts with Post Spacing"]
[]
[null,null,"Select The Appropriate Worksheet Based Off"]
[null,null,"the General Sign Selection Table Below:"]
[]
[null,null,null,"General Sign Selection Table"]
[null,null,null,null,"Sign Area","Sign Width"]
[null,null,null,null,"SQ.FT","FT."]
[null,null,null,"Wood","up to 50","up to 8"]
[null,null,null,"Channel","up to 30","up to 8"]
[null,null,null,"PSST","up to 24","up to 6"]
[null,null,null,"Pipe","up to 58.5","up to 10"]
[null,null,null,"Structural","21 - 540","5 to 30"]
[]
[null,null,null,"- Both Sign Area and Width Must Be Valid"]
[null,null,null,"   for Post Selection"]
[]
[null,null,"Revised August 2022"]

{"sheet":"Structural Post Selector","index":1,"n_rows":27,"n_cols":31,"rows_kept":27,"cut":false,"hidden":false,"merged":[[25,38,25,39],[26,38,26,39],[24,30,28,30],[11,2,11,6],[10,7,10,9],[23,2,33,2],[35,0,35,32],[3,4,3,25],[23,1,33,1],[0,0,0,32],[1,0,1,32],[11,25,11,28],[11,16,11,24],[9,18,9,24],[10,18,10,24],[23,3,33,3],[5,2,5,5],[9,2,9,6],[10,2,10,6],[6,2,6,10],[11,7,11,9],[9,10,9,12],[10,10,10,12],[11,10,11,12]]}
["Structural Shoulder Mounted Post Selector"]
[]
[]
[null,null,"Sign:"]
[]
[null,null,"Instructions"]
[null,null,"-Fill in all shaded boxes."]
[null,null,"-Press the Enter key after each selection."]
[]
[null,null,"Clear Height",null,null,null,null,"ft",null,null,null,null,null,null,null,null,null,null,"Number of Posts:",null,null,null,null,null,null,{"$f":"IF(K10=0,\" \",stpostnum(K10,K11,K12))","v":" "}]
[null,null,"Sign",null,null,null,null,"width, ft",null,null,null,null,null,null,null,null,null,null,"Design Number:",null,null,null,null,null,null,{"$f":"IF(K10=0,\" \",design(K10,K11,K12))","v":" "}]
[null,null,"Dimensions",null,null,null,null,"height, ft",null,null,null,null,null,null,null,null,"Nom. Size (in.) (lbs/ft):",null,null,null,null,null,null,null,null,{"$f":"(IF(Z11=1,\"W6x9\",IF(Z11=2,\"W6x15\",IF(Z11=3,\"W8x18\",IF(Z11=4,\"W10x22\",IF(Z11=5,\"W10x26\",IF(Z11=6,\"W12x26\",\" \")))))))","v":" "}]
[]
[null,null,null,null,null,null,null,null,null,null,null,null,null,null,null,null,null,null,null,null,null,{"$f":"IF(AND(wd<7,wd*ht>0,Z10=0),\"Error: Sign Too Small For Structural Post\",(IF(AND(Z11=0,wd*ht>0),\"Error: Invalid Sign Size\",\" \")))","v":" "}]
[]
[]
[]
[]
[]
[]
[]
[null,null,null,null,null,null,null,null,null,{"$f":"IF(AND(wd<7,F14>0),\"Error: Sign Too Small For Structural Post\",(IF(AND(Z11=0,F14>0),\"Error: Invalid Sign Size\",\" \")))","v":" "}]
[]
[null,null,"CLEAR HEIGHT","(Length of Longest Post)"]
[null,null,null,null,null,null,null,null,null,null,null,null,null,null,null,null,null,null,null,null,null,null,null,null,null,null,null,null,null,null,"MIN. 7 ft 9 in"]
[null,null,null,null,{"$f":"IF(AND(Z10 = 3, Z11 > 2,TRUNC((1/3)*wd) < 7),TRUNC((wd-(H26*2))*0.5),IF(Z10=3,TRUNC((1/6)*wd),\"-\"))","v":"-"},"ft",null,{"$f":"IF(AND(Z10 = 3, Z11 > 2,TRUNC((1/3)*wd) < 7),7,IF(Z10=3,TRUNC((1/3)*wd),\"-\"))","v":"-"},"ft",null,null,{"$f":"IF(AND(Z10 = 3, Z11 > 2,TRUNC((1/3)*wd) < 7),7,IF(Z10=3,TRUNC((1/3)*wd),\"-\"))","v":"-"},"ft",null,{"$f":"IF(AND(Z10 = 3, Z11 > 2,TRUNC((1/3)*wd) < 7),TRUNC((wd-(H26*2))*0.5),IF(Z10=3,TRUNC((1/6)*wd),\"-\"))","v":"-"},"ft",null,null,{"$f":"IF(AND(Z10 = 2, Z11 > 2,TRUNC(wd-(((1/5)*wd)*2)) < 7),TRUNC((wd-W26)*0.5),IF(Z10=2,TRUNC((1/5)*wd),\"-\"))","v":"-"},"ft",null,null,{"$f":"IF(AND(Z10 = 2, Z11 > 2,TRUNC(wd-(((1/5)*wd)*2)) < 7),7,IF(Z10=2,TRUNC(wd-(((1/5)*wd)*2)),\"-\"))","v":"-"},"ft",null,null,{"$f":"IF(AND(Z10 = 2, Z11 > 2,TRUNC(wd-(((1/5)*wd)*2)) < 7),TRUNC((wd-W26)*0.5),IF(Z10=2,TRUNC((1/5)*wd),\"-\"))","v":"-"},"ft"]
[null,null,null,null,{"$f":"IF(AND(Z10 = 3, Z11 > 2,TRUNC((1/3)*wd) < 7),(((wd-(H26*2))*0.5)-E26)*12,IF(Z10=3,(((1/6)*wd)-E26)*12,\"-\"))","v":"-"},"in",null,{"$f":"IF(AND(Z10=3,Z11>2,TRUNC((1/3)*wd)<7),0,IF(Z10=3,(((wd*12)-((ROUND(((1/6)*wd)*12,0)*2)))/2)-(H26*12),\"-\"))","v":"-"},"in",null,null,{"$f":"IF(AND(Z10=3,Z11>2,TRUNC((1/3)*wd)<7),0,IF(Z10=3,(((wd*12)-((ROUND(((1/6)*wd)*12,0)*2)))/2)-(H26*12),\"-\"))","v":"-"},"in",null,{"$f":"IF(AND(Z10 = 3, Z11 > 2,TRUNC((1/3)*wd) < 7),(((wd-(H26*2))*0.5)-E26)*12,IF(Z10=3,(((1/6)*wd)-E26)*12,\"-\"))","v":"-"},"in",null,null,{"$f":"IF(AND(Z10 = 2, Z11 > 2,TRUNC(wd-(((1/5)*wd)*2)) < 7),(((wd-W26)*0.5)-S26)*12,IF(Z10=2,(((1/5)*wd)-S26)*12,\"-\"))","v":"-"},"in",null,null,{"$f":"IF(AND(Z10=2,Z11>2,TRUNC(wd-(((1/5)*wd)*2))<7),0,IF(Z10=2,((wd*12)-((ROUND(((1/5)*wd)*12,0)*2))-(W26*12)),\"-\"))","v":"-"},"in",null,null,{"$f":"IF(AND(Z10 = 2, Z11 > 2,TRUNC(wd-(((1/5)*wd)*2)) < 7),(((wd-W26)*0.5)-S26)*12,IF(Z10=2,(((1/5)*wd)-S26)*12,\"-\"))","v":"-"},"in"]

{"sheet":"Pipe Post Selector","index":2,"n_rows":49,"n_cols":26,"rows_kept":49,"cut":false,"hidden":false,"merged":[[0,0,0,28],[1,0,1,28],[4,4,4,22],[7,2,7,22],[12,16,12,22],[6,2,6,9],[35,17,35,28],[12,23,12,24],[12,2,12,6],[12,7,12,9],[12,10,12,12],[13,16,13,22],[14,16,14,22],[13,2,13,6],[34,2,34,15],[15,16,15,22],[24,22,30,22],[34,17,34,28],[42,11,42,15],[13,10,13,12],[36,5,36,10],[38,5,38,10],[39,5,39,10],[40,5,40,10],[13,7,13,9],[24,10,29,10],[36,11,36,15],[24,9,29,9],[24,8,29,8],[35,5,35,10],[35,11,35,15],[13,23,13,24],[14,23,14,24],[35,2,35,4],[36,2,36,4],[41,11,41,15],[36,17,36,28],[37,17,37,28],[38,17,38,28],[38,2,38,4],[37,2,37,4],[37,11,37,15],[37,5,37,10],[41,5,41,10],[38,11,38,15],[39,11,39,15],[39,2,39,4],[43,11,43,15],[39,17,39,28],[41,17,41,28],[40,17,40,28],[48,2,49,15],[44,2,44,4],[44,5,44,10],[44,11,44,15],[43,5,43,10],[40,11,40,15],[43,2,43,4],[45,2,45,15],[40,2,40,4],[41,2,41,4],[42,2,42,4],[42,5,42,10]]}
["Pipe Mounted Post Selector"]
[]
[]
[]
[null,null,"Sign:"]
[]
[null,null,"Instructions"]
[null,null,"-Fill in all shaded boxes."]
[null,null,"-Press the Enter key after each selection."]
[null,null,"-This worksheet automatically calculates post size for rectangular signs only."]
[null,null,"-For Warning, Yield, and Stop signs use the Pipe Post Selection Table."]
[]
[null,null,"Sign",null,null,null,null,"width ft",null,null,null,null,null,null,null,null,"Number of Posts:",null,null,null,null,null,null,{"$f":"(IF(width=0,\" \",(IF(width>10,\"Error\",(IF(X15>58.5,\"Error\",(IF(width<=4,1,2)+AND(width=4,height>8,1,2)-AND(width=4.5,height<=1.5,1,2))))))))","v":" "}]
[null,null,"Dimensions",null,null,null,null,"height ft",null,null,null,null,null,null,null,null,"Post Size:",null,null,null,null,null,null,{"$f":"(IF(width=0,\" \",(IF(X15<15,2.5,4))))","v":" "},null,"in"]
[null,null,null,null,null,null,null,null,null,null,null,null,null,null,null,null,"Sign Size:",null,null,null,null,null,null,{"$f":"IF(width=0,0,width*height)","v":0},null,"sq. ft."]
[null,null,null,null,null,null,null,null,{"$f":"(IF(AND(width=1,height>10),\"Error: Invalid Sign Size\",(IF(AND(width=3,height>=10),\"Error: Invalid Sign Size\",(IF(X15>58.5,\"Sign Too Big: Use Structural Post\",(IF(width>10,\"Too Wide For two Pipe Posts: Use Structural\",\" \"))))))))","v":" "},null,null,null,null,null,null,null,"Sign Type:",null,null,null,null,null,null,{"$f":"(IF(width=0,\" \",IF(OR(width=5.5,width=6.5,width=7.5),\"Use 1 ft Increments for Extruded\",IF(AND(X15<=58.5,K13<=5),\"Flat Sheet\",\"Extruded\"))))","v":" "}]
[]
[]
[]
[]
[]
[]
[]
[]
[null,null,null,null,null,null,null,null,"MIN 5 ft - Rural","OR","MIN 7 ft - Urban",null,null,null,null,null,null,null,null,null,null,null,"Shortest Post ≥ 5 ft"]
[]
[]
[null,null,null,null,null,null,null,null,null,null,null,{"$f":"IF(X13=2,TRUNC((1/5)*width), \"-\")","v":"-"},"ft",null,null,{"$f":"IF(X13=2,TRUNC((3/5)*width),\"-\")","v":"-"},"ft",null,null,{"$f":"IF(X13=2,TRUNC((1/5)*width), \"-\")","v":"-"},"ft"]
[null,null,null,null,null,null,null,null,null,null,null,{"$f":"IF(X13=2,(((1/5)*width)-L28)*12,\"-\")","v":"-"},"in",null,null,{"$f":"IF(X13=2,(((3/5)*width)-P28)*12,\"-\")","v":"-"},"in",null,null,{"$f":"IF(X13=2,(((1/5)*width)-L28)*12,\"-\")","v":"-"},"in"]
[]
[]
[]
[]
[]
[null,null,"Warning, Yield, and Stop Signs",null,null,null,null,null,null,null,null,null,null,null,null,null,null,"Pipe Post Notes"]
[null,null,"Sign Size",null,null,"Sign Type",null,null,null,null,null,"Post Required",null,null,null,null,null,"- Max sign width on one pipe post = 4 ft"]
[null,null,"36\" x 36\"",null,null,"Warning Signs 1",null,null,null,null,null,"1 - 2.5\" Post",null,null,null,null,null,"- Max sign width on two pipe posts = 10 ft"]
[null,null,"36\" x 36\"",null,null,"Warning Signs 2",null,null,null,null,null,"1 - 2.5\" Post",null,null,null,null,null,"- Max sign sqft on pipe post = 58.5 sqft"]
[null,null,"48\" x 48\"",null,null,"Warning Signs 3",null,null,null,null,null,"1 - 4\" Post",null,null,null,null,null,"- Pipe post size = inside pipe diameter"]
[null,null,"48\" x 48\" ",null,null,"Yield Signs 3",null,null,null,null,null,"1 - 4\" Post",null,null,null,null,null,"- For signs widths between sizes shown, go to"]
[null,null,"60\" x 60\"",null,null,"Yield Signs 4",null,null,null,null,null,"1 - 4\" Post",null,null,null,null,null,"   next largest width (example: a sign that is"]
[null,null,"36\" x 36\"",null,null,"Stop Signs 1",null,null,null,null,null,"1 - 2.5\" Post",null,null,null,null,null,"   2-1/2' wide, use the chart for a sign width = 3'"]
[null,null,"36\" x 36\"",null,null,"Stop Signs 3,4",null,null,null,null,null,"1 - 4\" Post"]
[null,null,"48\" x 48\"",null,null,"Stop Signs 3,4",null,null,null,null,null,"1 - 4\" Post"]
[null,null,"54\" x 18\"",null,null,"One Way Signs 1",null,null,null,null,null,"1 - 2.5\" Post"]
[null,null,"1 - without plaques"]
[null,null,"2 - with plaques"]
[null,null,"3 - with or without plaques"]
[null,null,"4 - with or without 54\" x 18\" or 36\" x 12\" one way signs mounted above"]

{"sheet":"Wood Post Selector","index":3,"n_rows":28,"n_cols":26,"rows_kept":28,"cut":false,"hidden":false,"merged":[[23,5,28,5],[24,6,28,6],[23,20,31,20],[23,7,29,7],[10,9,10,11],[10,6,10,8],[12,15,12,21],[11,15,11,21],[10,1,10,5],[0,0,0,26],[1,0,1,26],[9,22,9,24],[10,22,10,24],[11,22,11,24],[9,6,9,8],[9,9,9,11],[3,3,3,22],[9,15,9,21],[10,15,10,21],[5,1,5,6],[6,1,6,25],[9,1,9,5]]}
["Wood Mounted Sign Post Selector"]
[]
[]
[null,"Sign:"]
[]
[null,"Instructions"]
[null,"-Fill in all shaded boxes."]
[null,"-Press the Enter key after each selection."]
[]
[null,"Sign",null,null,null,null,"width ft",null,null,null,null,null,null,null,null,"Number of Posts:",null,null,null,null,null,null,{"$f":"IF(J10=0,\" \",(IF(W12>50,\"Error\",(IF(J10>8,\"Error\",(IF(W12=0,0,(IF(J10>=16,2,(IF(AND(W12<=16,J10<4),1,2)))))))))))","v":" "}]
[null,"Dimensions",null,null,null,null,"height ft",null,null,null,null,null,null,null,null,"Post Size:",null,null,null,null,null,null,{"$f":"IF(J10=0,\" \",IF(OR(J10=5.5,J10=6.5,J10=7.5),0,(IF(W12=0,0,(IF(W12>30,\"6X6\",(IF(W12>16,\"4X6\",(IF(AND(W12>10,W12<=16,W10=1),\"4X6\",\"4X4\"))))))))))","v":" "},null,null,"in."]
[null,null,null,null,null,null,null,null,null,null,null,null,null,null,null,"Sign Size:",null,null,null,null,null,null,{"$f":"IF(J10=0,\" \",J11*J10)","v":" "},null,null,"sq. ft."]
[null,null,null,null,null,null,null,{"$f":"(IF(W12=\" \", \" \",IF(W12>50,\"Sign Too Big: Use Structural Post\",(IF(J10>8,\"Too Wide for 2 Wood Posts: Use Structural\",\" \")))))","v":" "},null,null,null,null,null,null,null,"Sign Type:",null,null,null,null,null,null,{"$f":"IF(J10=0,\" \",IF(OR(J10=5.5,J10=6.5,J10=7.5),\"Use 1 ft Increments for Extruded\",IF(AND(W12<=30,J10<6),\"Flat Sheet\",\"Extruded\")))","v":" "}]
[]
[]
[]
[]
[]
[]
[]
[]
[]
[]
[null,null,null,null,null,"MIN 5 ft - Rural",null,"MIN 7 ft - Urban",null,null,null,null,null,null,null,null,null,null,null,null,"Shortest Post ≥ 5ft"]
[null,null,null,null,null,null,"OR"]
[]
[null,null,null,null,null,null,null,null,null,{"$f":"IF(W10=2,TRUNC((1/5)*J10), \"-\")","v":"-"},"ft",null,null,{"$f":"IF(W10=2,TRUNC((3/5)*J10),\"-\")","v":"-"},"ft",null,null,{"$f":"IF(W10=2,TRUNC((1/5)*J10), \"-\")","v":"-"},"ft"]
[null,null,null,null,null,null,null,null,null,{"$f":"IF(W10=2,(((1/5)*J10)-J27)*12,\"-\")","v":"-"},"in",null,null,{"$f":"IF(W10=2,(((3/5)*J10)-N27)*12,\"-\")","v":"-"},"in",null,null,{"$f":"IF(W10=2,(((1/5)*J10)-J27)*12,\"-\")","v":"-"},"in"]

{"sheet":"PSST Post Selector","index":4,"n_rows":780,"n_cols":22,"rows_kept":780,"cut":false,"hidden":false,"merged":[[763,4,763,12],[689,0,689,12],[691,4,691,12],[709,4,709,12],[727,4,727,12],[489,4,489,12],[745,4,745,12],[507,4,507,12],[525,4,525,12],[543,4,543,12],[561,4,561,12],[579,4,579,12],[597,0,597,12],[599,4,599,12],[617,4,617,12],[635,4,635,12],[653,4,653,12],[671,4,671,12],[415,4,415,12],[433,0,433,12],[435,4,435,12],[453,4,453,12],[471,4,471,12],[325,4,325,12],[343,4,343,12],[361,4,361,12],[379,4,379,12],[397,4,397,12],[251,4,251,12],[269,0,269,12],[271,4,271,12],[289,4,289,12],[307,4,307,12],[161,4,161,12],[179,4,179,12],[197,4,197,12],[215,4,215,12],[233,4,233,12],[87,4,87,12],[105,4,105,12],[123,4,123,12],[141,4,141,12],[159,0,159,12],[45,1,45,5],[47,4,47,13],[49,0,49,12],[51,4,51,12],[69,4,69,12],[42,0,43,1],[43,5,43,6],[29,10,35,10],[29,4,35,4],[40,0,40,1],[41,0,41,1],[41,4,41,6],[41,7,41,11],[13,1,13,2],[41,12,41,16],[0,0,0,20],[1,0,1,20],[18,19,25,19],[3,3,3,10],[9,5,9,7],[40,4,40,5],[24,3,32,3],[25,16,33,16],[13,13,13,17],[18,17,25,17],[9,13,9,17],[10,5,10,7],[10,8,10,11],[9,8,9,11],[12,1,12,2],[10,13,10,15],[11,8,11,12],[11,13,11,20],[11,1,11,2],[12,5,12,7],[12,8,12,12],[12,13,12,17]]}
["PSST Mounted Sign Post Selector"]
[]
[]
[null,null,"Sign:"]
[]
[null,null,"Instructions:","-Fill in all shaded boxes."]
[null,null,null,"-Press the Enter key after each selection."]
[null,null,null,"-Width and height should be entered in half-foot increments (up to a maximum of 8 feet)."]
[]
[null,null,null,null,null,null,null,null,{"$f":"IF(I11=2,\"Double Post Installation\",IF(I11=1,\"Single Post Installation\",\"\"))","v":"Double Post Installation"},null,null,null,null,{"$f":"IF(N11=3,\"Triple Post Installation\",\"\")","v":"Triple Post Installation"}]
[null,null,null,null,null,"Number of Posts:",null,null,{"$f":"IF(OR(D12=\"\",D12=0,D12>15,I12=\"Sign too big.  Use different post.\"),\"\",H44)","v":2},null,null,null,{"$f":"IF(OR(C41=6,C41=6.5,C41=7,C41=7.5,C41=8),\"OR\",\"\")","v":"OR"},{"$f":"IF(N12=\"Sign too big.  Use different post.\",\"\",IF(OR(D12=\"\",D12=0),\"\",IF(D12>15,\"\",IF(N12=\"-\",\"-\",M44))))","v":3}]
[null,"Clear Height:",null,5,"ft.",null,null,"Post Size:",{"$f":"H42","v":"2.5\" w/ 2.25\" inside"},null,null,null,null,{"$f":"M42","v":"2.5\""}]
[null,"Sign Width:",null,7,"ft.",null,null,null,{"$f":"IF(I11=\"\",\"\",\"12 gauge\")","v":"12 gauge"},null,null,null,null,{"$f":"IF(OR(N11=\"\",N11=\"-\"),\"\",\"12 gauge\")","v":"12 gauge"}]
[null,"Sign Height:",null,8,"ft.",null,null,null,{"$f":"H43","v":"BREAKAWAY REQUIRED"},null,null,null,null,{"$f":"M43","v":"BREAKAWAY REQUIRED"}]
[null,null,null,null,null,{"$f":"IF(D12>15,\"ERROR: Clear height must be less than or equal to 15'.\",\"\")","v":""}]
[null,null,null,null,null,null,null,null,null,null,null,null,null,null,null,null,null,null,null,null,null," "]
[]
[]
[]
[]
[]
[]
[]
[]
[null,null,null,"MIN 5 ft - Rural                 OR                            MIN 7 ft - Urban"]
[null,null,null,null,null,null,null,null,null,null,null,null,null,null,null,null,"Not less than 5 ft"]
[]
[null,null,null,null,{"$f":"IF(I11=2,TRUNC((1/5)*D13),\"-\")","v":1},"ft.",{"$f":"IF(I11=2,TRUNC(D13*3/5),\"-\")","v":4},"ft.",{"$f":"IF(I11=2,TRUNC((1/5)*D13),\"-\")","v":1},"ft.",{"$f":"IF(N11=3,TRUNC(1/6*D13),\"-\")","v":1},"ft.",null,null,{"$f":"IF(N11=3,TRUNC(1/6*D13),\"-\")","v":1},"ft."]
[null,null,null,null,{"$f":"IF(I11=2,(((1/5)*D13)-E28)*12,\"-\")","v":4.8000000000000016},"in.",{"$f":"IF(I11=2,(((D13*3/5)-G28)*12),\"-\")","v":2.4000000000000021},"in.",{"$f":"IF(I11=2,(((1/5)*D13)-I28)*12,\"-\")","v":4.8000000000000016},"in.",{"$f":"IF(N11=3,(((1/6)*D13)-K28)*12,\"-\")","v":1.9999999999999982},"in.",null,null,{"$f":"IF(N11=3,(((1/6)*D13)-O28)*12,\"-\")","v":1.9999999999999982},"in."]
[null,null,null,null,"CLEAR HEIGHT",null,null,null,null,null,"CLEAR HEIGHT",{"$f":"IF(N11=3,TRUNC(1/3*D13),\"-\")","v":2},"ft.",{"$f":"IF(N11=3,TRUNC(1/3*D13),\"-\")","v":2},"ft."]
[null,null,null,null,null,null,null,null,null,null,null,{"$f":"IF(N11=3,(((1/3)*D13)-L30)*12,\"-\")","v":3.9999999999999964},"in.",{"$f":"IF(N11=3,(((1/3)*D13)-N30)*12,\"-\")","v":3.9999999999999964},"in."]
[]
[]
[]
[]
[]
[]
[]
[]
[null,null,null,null,null,null,null,"Single",null,"Double",null,">7' Width","Triple"]
["Sign Width:",null,{"$f":"(ROUNDUP(D13/0.5,0))/2","v":7},null,null,null,null,{"$f":"IF(C41=1,VLOOKUP(C42,B54:O68,C44-1),IF(C41=1.5,VLOOKUP(C42,B72:O86,C44-1),IF(C41=2,VLOOKUP(C42,B90:O104,C44-1),IF(C41=2.5,VLOOKUP(C42,B108:O122,C44-1),IF(C41=3,VLOOKUP(C42,B126:O140,C44-1),IF(C41=3.5,VLOOKUP(C42,B144:O158,C44-1),\"\"))))))","v":""},null,{"$f":"IF(C41=4,VLOOKUP(C42,B274:O288,C44-1),IF(C41=4.5,VLOOKUP(C42,B292:O306,C44-1),IF(C41=5,VLOOKUP(C42,B310:O324,C44-1),IF(C41=5.5,VLOOKUP(C42,B328:O342,C44-1),IF(C41=6,VLOOKUP(C42,B346:O360,C44-1),IF(C41=6.5,VLOOKUP(C42,B364:O378,C44-1),IF(C41=7,VLOOKUP(C42,B382:O396,C44-1),\"\")))))))","v":"2.5\" w/ 2.25\" inside"},null,{"$f":"IF(C41=7.5,VLOOKUP(C42,B400:O414,C44-1),IF(C41=8,VLOOKUP(C42,B418:O432,C44-1),\"\"))","v":""},{"$f":"IF(C41=6,VLOOKUP(C42,B602:O616,C44-1),IF(C41=6.5,VLOOKUP(C42,B620:O634,C44-1),IF(C41=7,VLOOKUP(C42,B638:O652,C44-1),IF(C41=7.5,VLOOKUP(C42,B656:O670,C44-1),IF(C41=8,VLOOKUP(C42,B674:O688,C44-1),\"\")))))","v":"2.5\""}]
["Sign Height:",null,{"$f":"(ROUNDUP(D14/0.5,0))/2","v":8},null,"Post Size:",null,null,{"$f":"IF(OR(D12=\"\",D12=0,D13>8,D14>8),\"\",IF(C44>15,\"ERROR: Distance too great.\",IF(OR(C41=7.5,C41=8),L41,IF(C41<4,H41,IF(C41>=4,J41,\"\")))))","v":"2.5\" w/ 2.25\" inside"},null,null,null,null,{"$f":"IF(OR(D12=\"\",D12=0,C41>8,C42>8),\"\",IF(D12>15,\"ERROR: Distance too great.\",IF(C41>=6,M41,\"\")))","v":"2.5\""}]
["Ground to bottom of sign:",null,null,null,null,null,null,{"$f":"IF(AND(H44=2,H42=H46),\"BREAKAWAY REQUIRED\",IF(H42=I46,\"BREAKAWAY REQUIRED\",IF(AND(H44=3,H42=H46),\"BREAKAWAY REQUIRED\",IF(AND(H44=3,H42=L46),\"BREAKAWAY REQUIRED\",IF(H42=\"-\",\"-\",\"\")))))","v":"BREAKAWAY REQUIRED"},null,null,null,null,{"$f":"IF(OR(M42=\"\",M42=\"-\"),\"\",IF(M42=\"Sign too big.  Use different post.\",\"\",IF(M44=3,\"BREAKAWAY REQUIRED\",\"\")))","v":"BREAKAWAY REQUIRED"}]
[null,null,{"$f":"IF(D12<5,5,ROUNDUP(D12,0))","v":5},null,null,"Number of Posts:",null,{"$f":"IF(C41>8,\"ERROR: Too wide.\",IF(C42>8,\"ERROR: Too tall.\",IF(OR(C41=\"\",C41=0),\"\",IF(C41<4,1,IF(C41>=4,2,\"\")))))","v":2},null,null,null,null,{"$f":"IF(C41>8,\"ERROR: Too wide.\",IF(C42>8,\"ERROR: Too tall.\",IF(C41>=6,3,\"\")))","v":3}]
[]
[null,"2.5 inch post with a 2.25\" post inside & slip base",null,null,null,null,null,"2.5\"","2.5\" w/ 2.25\" inside",null,null,"2\""]
[]
[null,"Sign is too big for PSST.",null,null,"Slip base required when using 2.5\" post w/ 2.25\" inside or when using 2 or more 2.5\" posts."]
[]
["SINGLE POST - 5' MOUNTING HEIGHT"]
[]
[null,null,null,null,5]
["width","height","centroid","area",5,6,7,8,9,10,11,12,13,14,15]
[1,1,{"$f":"B54/2","v":0.5},{"$f":"A54*B54","v":1},"2\"","2\"","2\"","2\"","2\"","2\"","2\"","2\"","2\"","2\"","2\""]
[1,{"$f":"B54+0.5","v":1.5},{"$f":"B55/2","v":0.75},{"$f":"A55*B55","v":1.5},"2\"","2\"","2\"","2\"","2\"","2\"","2\"","2\"","2\"","2\"","2\""]
[1,{"$f":"B55+0.5","v":2},1,2,"2\"","2\"","2\"","2\"","2\"","2\"","2\"","2\"","2\"","2\"","2\""]
[1,2.5,1.25,2.5,"2\"","2\"","2\"","2\"","2\"","2\"","2\"","2\"","2\"","2\"","2\""]
[1,3,1.5,3,"2\"","2\"","2\"","2\"","2\"","2\"","2\"","2\"","2\"","2\"","2\""]
[1,3.5,1.75,3.5,"2\"","2\"","2\"","2\"","2\"","2\"","2\"","2\"","2\"","2\"","2\""]
[1,4,2,4,"2\"","2\"","2\"","2\"","2\"","2\"","2\"","2\"","2\"","2\"","2\""]
[1,4.5,2.25,4.5,"2\"","2\"","2\"","2\"","2\"","2\"","2\"","2\"","2\"","2\"","2\""]
[1,5,2.5,5,"2\"","2\"","2\"","2\"","2\"","2\"","2\"","2\"","2\"","2\"","2\""]
[1,{"$f":"B62+0.5","v":5.5},2.75,5.5,"2\"","2\"","2\"","2\"","2\"","2\"","2\"","2\"","2\"","2\"","2\""]
[1,6,3,6,"2\"","2\"","2\"","2\"","2\"","2\"","2\"","2\"","2\"","2.5\"","2.5\""]
[1,6.5,3.25,6.5,"2\"","2\"","2\"","2\"","2\"","2\"","2\"","2\"","2\"","2.5\"","2.5\""]
[1,7,3.5,7,"2\"","2\"","2\"","2\"","2\"","2\"","2\"","2.5\"","2.5\"","2.5\"","2.5\""]
[1,{"$f":"B66+0.5","v":7.5},3.75,7.5,"2\"","2\"","2\"","2\"","2\"","2\"","2.5\"","2.5\"","2.5\"","2.5\"","2.5\""]
[1,8,4,8,"2\"","2\"","2\"","2\"","2\"","2.5\"","2.5\"","2.5\"","2.5\"","2.5\"","2.5\""]
[]
[null,null,null,null,5]
["width","height","centroid","area",5,6,7,8,9,10,11,12,13,14,15]
[1.5,1,{"$f":"B72/2","v":0.5},{"$f":"A72*B72","v":1.5},"2\"","2\"","2\"","2\"","2\"","2\"","2\"","2\"","2\"","2\"","2\""]
[1.5,{"$f":"B72+0.5","v":1.5},{"$f":"B73/2","v":0.75},{"$f":"A73*B73","v":2.25},"2\"","2\"","2\"","2\"","2\"","2\"","2\"","2\"","2\"","2\"","2\""]
[1.5,{"$f":"B73+0.5","v":2},1,3,"2\"","2\"","2\"","2\"","2\"","2\"","2\"","2\"","2\"","2\"","2\""]
[1.5,2.5,1.25,3.75,"2\"","2\"","2\"","2\"","2\"","2\"","2\"","2\"","2\"","2\"","2\""]
[1.5,3,1.5,4.5,"2\"","2\"","2\"","2\"","2\"","2\"","2\"","2\"","2\"","2\"","2\""]
[1.5,3.5,1.75,5.25,"2\"","2\"","2\"","2\"","2\"","2\"","2\"","2\"","2\"","2\"","2\""]
[1.5,4,2,6,"2\"","2\"","2\"","2\"","2\"","2\"","2\"","2\"","2\"","2\"","2.5\""]
[1.5,4.5,2.25,6.75,"2\"","2\"","2\"","2\"","2\"","2\"","2\"","2\"","2\"","2.5\"","2.5\""]
[1.5,5,2.5,7.5,"2\"","2\"","2\"","2\"","2\"","2\"","2\"","2.5\"","2.5\"","2.5\"","2.5\""]
[1.5,5.5,2.75,8.25,"2\"","2\"","2\"","2\"","2\"","2\"","2.5\"","2.5\"","2.5\"","2.5\"","2.5\""]
[1.5,6,3,9,"2\"","2\"","2\"","2\"","2.5\"","2.5\"","2.5\"","2.5\"","2.5\"","2.5\"","2.5\" w/ 2.25\" inside"]
[1.5,6.5,3.25,9.75,"2\"","2\"","2\"","2.5\"","2.5\"","2.5\"","2.5\"","2.5\"","2.5\"","2.5\" w/ 2.25\" inside","2.5\" w/ 2.25\" inside"]
[1.5,7,3.5,10.5,"2\"","2\"","2.5\"","2.5\"","2.5\"","2.5\"","2.5\"","2.5\"","2.5\" w/ 2.25\" inside","2.5\" w/ 2.25\" inside","2.5\" w/ 2.25\" inside"]
[1.5,7.5,3.75,11.25,"2\"","2.5\"","2.5\"","2.5\"","2.5\"","2.5\"","2.5\"","2.5\" w/ 2.25\" inside","2.5\" w/ 2.25\" inside","2.5\" w/ 2.25\" inside","2.5\" w/ 2.25\" inside"]
[1.5,8,4,12,"2.5\"","2.5\"","2.5\"","2.5\"","2.5\"","2.5\"","2.5\" w/ 2.25\" inside","2.5\" w/ 2.25\" inside","2.5\" w/ 2.25\" inside","2.5\" w/ 2.25\" inside","2.5\" w/ 2.25\" inside"]
[]
[null,null,null,null,5]
["width","height","centroid","area",5,6,7,8,9,10,11,12,13,14,15]
[2,1,{"$f":"B90/2","v":0.5},{"$f":"A90*B90","v":2},"2\"","2\"","2\"","2\"","2\"","2\"","2\"","2\"","2\"","2\"","2\""]
[2,{"$f":"B90+0.5","v":1.5},{"$f":"B91/2","v":0.75},{"$f":"A91*B91","v":3},"2\"","2\"","2\"","2\"","2\"","2\"","2\"","2\"","2\"","2\"","2\""]
[2,{"$f":"B91+0.5","v":2},1,4,"2\"","2\"","2\"","2\"","2\"","2\"","2\"","2\"","2\"","2\"","2\""]
[2,2.5,1.25,5,"2\"","2\"","2\"","2\"","2\"","2\"","2\"","2\"","2\"","2\"","2\""]
[2,3,1.5,6,"2\"","2\"","2\"","2\"","2\"","2\"","2\"","2\"","2\"","2\"","2\""]
[2,3.5,1.75,7,"2\"","2\"","2\"","2\"","2\"","2\"","2\"","2\"","2\"","2.5\"","2.5\""]
[2,4,2,8,"2\"","2\"","2\"","2\"","2\"","2\"","2\"","2.5\"","2.5\"","2.5\"","2.5\""]
[2,4.5,2.25,9,"2\"","2\"","2\"","2\"","2\"","2.5\"","2.5\"","2.5\"","2.5\"","2.5\"","2.5\""]
[2,5,2.5,10,"2\"","2\"","2\"","2\"","2.5\"","2.5\"","2.5\"","2.5\"","2.5\"","2.5\"","2.5\" w/ 2.25\" inside"]
[2,5.5,2.75,11,"2\"","2\"","2.5\"","2.5\"","2.5\"","2.5\"","2.5\"","2.5\"","2.5\" w/ 2.25\" inside","2.5\" w/ 2.25\" inside","2.5\" w/ 2.25\" inside"]
[2,6,3,12,"2\"","2.5\"","2.5\"","2.5\"","2.5\"","2.5\"","2.5\"","2.5\" w/ 2.25\" inside","2.5\" w/ 2.25\" inside","2.5\" w/ 2.25\" inside","2.5\" w/ 2.25\" inside"]
[2,6.5,3.25,13,"2.5\"","2.5\"","2.5\"","2.5\"","2.5\"","2.5\" w/ 2.25\" inside","2.5\" w/ 2.25\" inside","2.5\" w/ 2.25\" inside","2.5\" w/ 2.25\" inside","2.5\" w/ 2.25\" inside","2.5\" w/ 2.25\" inside"]
[2,7,3.5,14,"2.5\"","2.5\"","2.5\"","2.5\"","2.5\" w/ 2.25\" inside","2.5\" w/ 2.25\" inside","2.5\" w/ 2.25\" inside","2.5\" w/ 2.25\" inside","2.5\" w/ 2.25\" inside","2.5\" w/ 2.25\" inside","2.5\" w/ 2.25\" inside"]
[2,7.5,3.75,15,"2.5\"","2.5\"","2.5\"","2.5\" w/ 2.25\" inside","2.5\" w/ 2.25\" inside","2.5\" w/ 2.25\" inside","2.5\" w/ 2.25\" inside","2.5\" w/ 2.25\" inside","2.5\" w/ 2.25\" inside","2.5\" w/ 2.25\" inside","2.5\" w/ 2.25\" inside"]
[2,8,4,16,"2.5\"","2.5\"","2.5\" w/ 2.25\" inside","2.5\" w/ 2.25\" inside","2.5\" w/ 2.25\" inside","2.5\" w/ 2.25\" inside","2.5\" w/ 2.25\" inside","2.5\" w/ 2.25\" inside","2.5\" w/ 2.25\" inside","Sign too big.  Use different post.","Sign too big.  Use different post."]
[]
[null,null,null,null,5]
["width","height","centroid","area",5,6,7,8,9,10,11,12,13,14,15]
[2.5,1,{"$f":"B108/2","v":0.5},{"$f":"A108*B108","v":2.5},"2\"","2\"","2\"","2\"","2\"","2\"","2\"","2\"","2\"","2\"","2\""]
[2.5,{"$f":"B108+0.5","v":1.5},{"$f":"B109/2","v":0.75},{"$f":"A109*B109","v":3.75},"2\"","2\"","2\"","2\"","2\"","2\"","2\"","2\"","2\"","2\"","2\""]
[2.5,{"$f":"B109+0.5","v":2},1,5,"2\"","2\"","2\"","2\"","2\"","2\"","2\"","2\"","2\"","2\"","2\""]
[2.5,2.5,1.25,6.25,"2\"","2\"","2\"","2\"","2\"","2\"","2\"","2\"","2\"","2\"","2\""]
[2.5,3,1.5,7.5,"2\"","2\"","2\"","2\"","2\"","2\"","2\"","2\"","2.5\"","2.5\"","2.5\""]
[2.5,3.5,1.75,8.75,"2\"","2\"","2\"","2\"","2\"","2\"","2.5\"","2.5\"","2.5\"","2.5\"","2.5\""]
[2.5,4,2,10,"2\"","2\"","2\"","2\"","2.5\"","2.5\"","2.5\"","2.5\"","2.5\"","2.5\"","2.5\""]
[2.5,4.5,2.25,11.25,"2\"","2\"","2\"","2.5\"","2.5\"","2.5\"","2.5\"","2.5\"","2.5\" w/ 2.25\" inside","2.5\" w/ 2.25\" inside","2.5\" w/ 2.25\" inside"]
[2.5,5,2.5,12.5,"2\"","2\"","2.5\"","2.5\"","2.5\"","2.5\"","2.5\"","2.5\" w/ 2.25\" inside","2.5\" w/ 2.25\" inside","2.5\" w/ 2.25\" inside","2.5\" w/ 2.25\" inside"]
[2.5,5.5,2.75,13.75,"2\"","2.5\"","2.5\"","2.5\"","2.5\"","2.5\" w/ 2.25\" inside","2.5\" w/ 2.25\" inside","2.5\" w/ 2.25\" inside","2.5\" w/ 2.25\" inside","2.5\" w/ 2.25\" inside","2.5\" w/ 2.25\" inside"]
[2.5,6,3,15,"2.5\"","2.5\"","2.5\"","2.5\"","2.5\" w/ 2.25\" inside","2.5\" w/ 2.25\" inside","2.5\" w/ 2.25\" inside","2.5\" w/ 2.25\" inside","2.5\" w/ 2.25\" inside","2.5\" w/ 2.25\" inside","2.5\" w/ 2.25\" inside"]
[2.5,6.5,3.25,16.25,"2.5\"","2.5\"","2.5\"","2.5\" w/ 2.25\" inside","2.5\" w/ 2.25\" inside","2.5\" w/ 2.25\" inside","2.5\" w/ 2.25\" inside","2.5\" w/ 2.25\" inside","2.5\" w/ 2.25\" inside","2.5\" w/ 2.25\" inside","Sign too big.  Use different post."]
[2.5,7,3.5,17.5,"2.5\"","2.5\"","2.5\" w/ 2.25\" inside","2.5\" w/ 2.25\" inside","2.5\" w/ 2.25\" inside","2.5\" w/ 2.25\" inside","2.5\" w/ 2.25\" inside","2.5\" w/ 2.25\" inside","2.5\" w/ 2.25\" inside","Sign too big.  Use different post.","Sign too big.  Use different post."]
[2.5,7.5,3.75,18.75,"2.5\"","2.5\" w/ 2.25\" inside","2.5\" w/ 2.25\" inside","2.5\" w/ 2.25\" inside","2.5\" w/ 2.25\" inside","2.5\" w/ 2.25\" inside","2.5\" w/ 2.25\" inside","2.5\" w/ 2.25\" inside","Sign too big.  Use different post.","Sign too big.  Use different post.","Sign too big.  Use different post."]
[2.5,8,4,20,"2.5\" w/ 2.25\" inside","2.5\" w/ 2.25\" inside","2.5\" w/ 2.25\" inside","2.5\" w/ 2.25\" inside","2.5\" w/ 2.25\" inside","2.5\" w/ 2.25\" inside","2.5\" w/ 2.25\" inside","Sign too big.  Use different post.","Sign too big.  Use different post.","Sign too big.  Use different post.","Sign too big.  Use different post."]
[]
[null,null,null,null,5]
["width","height","centroid","area",5,6,7,8,9,10,11,12,13,14,15]
[3,1,{"$f":"B126/2","v":0.5},{"$f":"A126*B126","v":3},"2\"","2\"","2\"","2\"","2\"","2\"","2\"","2\"","2\"","2\"","2\""]
[3,{"$f":"B126+0.5","v":1.5},{"$f":"B127/2","v":0.75},{"$f":"A127*B127","v":4.5},"2\"","2\"","2\"","2\"","2\"","2\"","2\"","2\"","2\"","2\"","2\""]
[3,{"$f":"B127+0.5","v":2},1,6,"2\"","2\"","2\"","2\"","2\"","2\"","2\"","2\"","2\"","2\"","2\""]
[3,2.5,1.25,7.5,"2\"","2\"","2\"","2\"","2\"","2\"","2\"","2\"","2\"","2.5\"","2.5\""]
[3,3,1.5,9,"2\"","2\"","2\"","2\"","2\"","2\"","2.5\"","2.5\"","2.5\"","2.5\"","2.5\""]
[3,3.5,1.75,10.5,"2\"","2\"","2\"","2\"","2.5\"","2.5\"","2.5\"","2.5\"","2.5\"","2.5\"","2.5\" w/ 2.25\" inside"]
[3,4,2,12,"2\"","2\"","2.5\"","2.5\"","2.5\"","2.5\"","2.5\"","2.5\"","2.5\" w/ 2.25\" inside","2.5\" w/ 2.25\" inside","2.5\" w/ 2.25\" inside"]
[3,4.5,2.25,13.5,"2\"","2.5\"","2.5\"","2.5\"","2.5\"","2.5\"","2.5\" w/ 2.25\" inside","2.5\" w/ 2.25\" inside","2.5\" w/ 2.25\" inside","2.5\" w/ 2.25\" inside","2.5\" w/ 2.25\" inside"]
[3,5,2.5,15,"2.5\"","2.5\"","2.5\"","2.5\"","2.5\" w/ 2.25\" inside","2.5\" w/ 2.25\" inside","2.5\" w/ 2.25\" inside","2.5\" w/ 2.25\" inside","2.5\" w/ 2.25\" inside","2.5\" w/ 2.25\" inside","2.5\" w/ 2.25\" inside"]
[3,5.5,2.75,16.5,"2.5\"","2.5\"","2.5\"","2.5\" w/ 2.25\" inside","2.5\" w/ 2.25\" inside","2.5\" w/ 2.25\" inside","2.5\" w/ 2.25\" inside","2.5\" w/ 2.25\" inside","2.5\" w/ 2.25\" inside","2.5\" w/ 2.25\" inside","Sign too big.  Use different post."]
[3,6,3,18,"2.5\"","2.5\"","2.5\" w/ 2.25\" inside","2.5\" w/ 2.25\" inside","2.5\" w/ 2.25\" inside","2.5\" w/ 2.25\" inside","2.5\" w/ 2.25\" inside","2.5\" w/ 2.25\" inside","2.5\" w/ 2.25\" inside","Sign too big.  Use different post.","Sign too big.  Use different post."]
[3,6.5,3.25,19.5,"2.5\"","2.5\" w/ 2.25\" inside","2.5\" w/ 2.25\" inside","2.5\" w/ 2.25\" inside","2.5\" w/ 2.25\" inside","2.5\" w/ 2.25\" inside","2.5\" w/ 2.25\" inside","2.5\" w/ 2.25\" inside","Sign too big.  Use different post.","Sign too big.  Use different post.","Sign too big.  Use different post."]
[3,7,3.5,21,"2.5\" w/ 2.25\" inside","2.5\" w/ 2.25\" inside","2.5\" w/ 2.25\" inside","2.5\" w/ 2.25\" inside","2.5\" w/ 2.25\" inside","2.5\" w/ 2.25\" inside","2.5\" w/ 2.25\" inside","Sign too big.  Use different post.","Sign too big.  Use different post.","Sign too big.  Use different post.","Sign too big.  Use different post."]
[3,7.5,3.75,22.5,"2.5\" w/ 2.25\" inside","2.5\" w/ 2.25\" inside","2.5\" w/ 2.25\" inside","2.5\" w/ 2.25\" inside","2.5\" w/ 2.25\" inside","Sign too big.  Use different post.","Sign too big.  Use different post.","Sign too big.  Use different post.","Sign too big.  Use different post.","Sign too big.  Use different post.","Sign too big.  Use different post."]
[3,8,4,24,"2.5\" w/ 2.25\" inside","2.5\" w/ 2.25\" inside","2.5\" w/ 2.25\" inside","2.5\" w/ 2.25\" inside","Sign too big.  Use different post.","Sign too big.  Use different post.","Sign too big.  Use different post.","Sign too big.  Use different post.","Sign too big.  Use different post.","Sign too big.  Use different post.","Sign too big.  Use different post."]
[]
[null,null,null,null,5]
["width","height","centroid","area",5,6,7,8,9,10,11,12,13,14,15]
[3.5,1,{"$f":"B144/2","v":0.5},{"$f":"A144*B144","v":3.5},"2\"","2\"","2\"","2\"","2\"","2\"","2\"","2\"","2\"","2\"","2\""]
[3.5,{"$f":"B144+0.5","v":1.5},{"$f":"B145/2","v":0.75},{"$f":"A145*B145","v":5.25},"2\"","2\"","2\"","2\"","2\"","2\"","2\"","2\"","2\"","2\"","2\""]
[3.5,{"$f":"B145+0.5","v":2},1,7,"2\"","2\"","2\"","2\"","2\"","2\"","2\"","2\"","2\"","2\"","2.5\""]
[3.5,2.5,1.25,8.75,"2\"","2\"","2\"","2\"","2\"","2\"","2\"","2.5\"","2.5\"","2.5\"","2.5\""]
[3.5,3,1.5,10.5,"2\"","2\"","2\"","2\"","2.5\"","2.5\"","2.5\"","2.5\"","2.5\"","2.5\"","2.5\" w/ 2.25\" inside"]
[3.5,3.5,1.75,12.25,"2\"","2\"","2\"","2.5\"","2.5\"","2.5\"","2.5\"","2.5\"","2.5\" w/ 2.25\" inside","2.5\" w/ 2.25\" inside","2.5\" w/ 2.25\" inside"]
[3.5,4,2,14,"2\"","2.5\"","2.5\"","2.5\"","2.5\"","2.5\"","2.5\" w/ 2.25\" inside","2.5\" w/ 2.25\" inside","2.5\" w/ 2.25\" inside","2.5\" w/ 2.25\" inside","2.5\" w/ 2.25\" inside"]
[3.5,4.5,2.25,15.75,"2.5\"","2.5\"","2.5\"","2.5\"","2.5\" w/ 2.25\" inside","2.5\" w/ 2.25\" inside","2.5\" w/ 2.25\" inside","2.5\" w/ 2.25\" inside","2.5\" w/ 2.25\" inside","2.5\" w/ 2.25\" inside","2.5\" w/ 2.25\" inside"]
[3.5,5,2.5,17.5,"2.5\"","2.5\"","2.5\"","2.5\" w/ 2.25\" inside","2.5\" w/ 2.25\" inside","2.5\" w/ 2.25\" inside","2.5\" w/ 2.25\" inside","2.5\" w/ 2.25\" inside","2.5\" w/ 2.25\" inside","2.5\" w/ 2.25\" inside","Sign too big.  Use different post."]
[3.5,5.5,2.75,19.25,"2.5\"","2.5\" w/ 2.25\" inside","2.5\" w/ 2.25\" inside","2.5\" w/ 2.25\" inside","2.5\" w/ 2.25\" inside","2.5\" w/ 2.25\" inside","2.5\" w/ 2.25\" inside","2.5\" w/ 2.25\" inside","2.5\" w/ 2.25\" inside","Sign too big.  Use different post.","Sign too big.  Use different post."]
[3.5,6,3,21,"2.5\"","2.5\" w/ 2.25\" inside","2.5\" w/ 2.25\" inside","2.5\" w/ 2.25\" inside","2.5\" w/ 2.25\" inside","2.5\" w/ 2.25\" inside","2.5\" w/ 2.25\" inside","Sign too big.  Use different post.","Sign too big.  Use different post.","Sign too big.  Use different post.","Sign too big.  Use different post."]
[3.5,6.5,3.25,22.75,"2.5\" w/ 2.25\" inside","2.5\" w/ 2.25\" inside","2.5\" w/ 2.25\" inside","2.5\" w/ 2.25\" inside","2.5\" w/ 2.25\" inside","2.5\" w/ 2.25\" inside","Sign too big.  Use different post.","Sign too big.  Use different post.","Sign too big.  Use different post.","Sign too big.  Use different post.","Sign too big.  Use different post."]
[3.5,7,3.5,24.5,"2.5\" w/ 2.25\" inside","2.5\" w/ 2.25\" inside","2.5\" w/ 2.25\" inside","2.5\" w/ 2.25\" inside","2.5\" w/ 2.25\" inside","Sign too big.  Use different post.","Sign too big.  Use different post.","Sign too big.  Use different post.","Sign too big.  Use different post.","Sign too big.  Use different post.","Sign too big.  Use different post."]
[3.5,7.5,3.75,26.25,"2.5\" w/ 2.25\" inside","2.5\" w/ 2.25\" inside","2.5\" w/ 2.25\" inside","Sign too big.  Use different post.","Sign too big.  Use different post.","Sign too big.  Use different post.","Sign too big.  Use different post.","Sign too big.  Use different post.","Sign too big.  Use different post.","Sign too big.  Use different post.","Sign too big.  Use different post."]
[3.5,8,4,28,"2.5\" w/ 2.25\" inside","2.5\" w/ 2.25\" inside","2.5\" w/ 2.25\" inside","Sign too big.  Use different post.","Sign too big.  Use different post.","Sign too big.  Use different post.","Sign too big.  Use different post.","Sign too big.  Use different post.","Sign too big.  Use different post.","Sign too big.  Use different post.","Sign too big.  Use different post."]
[]
["SINGLE POST - 7' MOUNTING HEIGHT"]
[]
[null,null,null,null,7]
["width","height","centroid","area",7,8,9,10,11,12,13,14,15]
[1,1,{"$f":"B164/2","v":0.5},{"$f":"A164*B164","v":1},"2\"","2\"","2\"","2\"","2\"","2\"","2\"","2\"","2\""]
[1,{"$f":"B164+0.5","v":1.5},{"$f":"B165/2","v":0.75},{"$f":"A165*B165","v":1.5},"2\"","2\"","2\"","2\"","2\"","2\"","2\"","2\"","2\""]
[1,{"$f":"B165+0.5","v":2},1,2,"2\"","2\"","2\"","2\"","2\"","2\"","2\"","2\"","2\""]
[1,2.5,1.25,2.5,"2\"","2\"","2\"","2\"","2\"","2\"","2\"","2\"","2\""]
[1,3,1.5,3,"2\"","2\"","2\"","2\"","2\"","2\"","2\"","2\"","2\""]
[1,3.5,1.75,3.5,"2\"","2\"","2\"","2\"","2\"","2\"","2\"","2\"","Sign too big.  Use different post."]
[1,4,2,4,"2\"","2\"","2\"","2\"","2\"","2\"","2\"","2\"","Sign too big.  Use different post."]
[1,4.5,2.25,4.5,"2\"","2\"","2\"","2\"","2\"","2\"","2\"","2\"","Sign too big.  Use different post."]
[1,5,2.5,5,"2\"","2\"","2\"","2\"","2\"","2\"","2\"","2\"","Sign too big.  Use different post."]
[1,{"$f":"B172+0.5","v":5.5},2.75,5.5,"2\"","2\"","2\"","2\"","2\"","2\"","2\"","Sign too big.  Use different post.","Sign too big.  Use different post."]
[1,6,3,6,"2\"","2\"","2\"","2\"","2\"","2\"","2\"","Sign too big.  Use different post.","Sign too big.  Use different post."]
[1,6.5,3.25,6.5,"2\"","2\"","2\"","2\"","2\"","2\"","2.5\"","Sign too big.  Use different post.","Sign too big.  Use different post."]
[1,7,3.5,7,"2\"","2\"","2\"","2\"","2\"","2.5\"","2.5\"","Sign too big.  Use different post.","Sign too big.  Use different post."]
[1,{"$f":"B176+0.5","v":7.5},3.75,7.5,"2\"","2\"","2\"","2\"","2.5\"","2.5\"","Sign too big.  Use different post.","Sign too big.  Use different post.","Sign too big.  Use different post."]
[1,8,4,8,"2\"","2\"","2\"","2.5\"","2.5\"","2.5\"","Sign too big.  Use different post.","Sign too big.  Use different post.","Sign too big.  Use different post."]
[]
[null,null,null,null,7]
["width","height","centroid","area",7,8,9,10,11,12,13,14,15]
[1.5,1,{"$f":"B182/2","v":0.5},{"$f":"A182*B182","v":1.5},"2\"","2\"","2\"","2\"","2\"","2\"","2\"","2\"","2\""]
[1.5,{"$f":"B182+0.5","v":1.5},{"$f":"B183/2","v":0.75},{"$f":"A183*B183","v":2.25},"2\"","2\"","2\"","2\"","2\"","2\"","2\"","2\"","2\""]
[1.5,{"$f":"B183+0.5","v":2},1,3,"2\"","2\"","2\"","2\"","2\"","2\"","2\"","2\"","2\""]
[1.5,2.5,1.25,3.75,"2\"","2\"","2\"","2\"","2\"","2\"","2\"","2\"","2\""]
[1.5,3,1.5,4.5,"2\"","2\"","2\"","2\"","2\"","2\"","2\"","2\"","2\""]
[1.5,3.5,1.75,5.25,"2\"","2\"","2\"","2\"","2\"","2\"","2\"","2\"","Sign too big.  Use different post."]
[1.5,4,2,6,"2\"","2\"","2\"","2\"","2\"","2\"","2\"","2\"","Sign too big.  Use different post."]
[1.5,4.5,2.25,6.75,"2\"","2\"","2\"","2\"","2\"","2\"","2\"","2.5\"","Sign too big.  Use different post."]
[1.5,5,2.5,7.5,"2\"","2\"","2\"","2\"","2\"","2.5\"","2.5\"","2.5\"","Sign too big.  Use different post."]
[1.5,5.5,2.75,8.25,"2\"","2\"","2\"","2.5\"","2.5\"","2.5\"","2.5\"","Sign too big.  Use different post.","Sign too big.  Use different post."]
[1.5,6,3,9,"2\"","2\"","2.5\"","2.5\"","2.5\"","2.5\"","2.5\"","Sign too big.  Use different post.","Sign too big.  Use different post."]
[1.5,6.5,3.25,9.75,"2\"","2.5\"","2.5\"","2.5\"","2.5\"","2.5\"","2.5\"","Sign too big.  Use different post.","Sign too big.  Use different post."]
[1.5,7,3.5,10.5,"2.5\"","2.5\"","2.5\"","2.5\"","2.5\"","2.5\"","2.5\" w/ 2.25\" inside","Sign too big.  Use different post.","Sign too big.  Use different post."]
[1.5,7.5,3.75,11.25,"2.5\"","2.5\"","2.5\"","2.5\"","2.5\"","2.5\" w/ 2.25\" inside","Sign too big.  Use different post.","Sign too big.  Use different post.","Sign too big.  Use different post."]
[1.5,8,4,12,"2.5\"","2.5\"","2.5\"","2.5\"","2.5\" w/ 2.25\" inside","2.5\" w/ 2.25\" inside","Sign too big.  Use different post.","Sign too big.  Use different post.","Sign too big.  Use different post."]
[]
[null,null,null,null,7]
["width","height","centroid","area",7,8,9,10,11,12,13,14,15]
[2,1,{"$f":"B200/2","v":0.5},{"$f":"A200*B200","v":2},"2\"","2\"","2\"","2\"","2\"","2\"","2\"","2\"","2\""]
[2,{"$f":"B200+0.5","v":1.5},{"$f":"B201/2","v":0.75},{"$f":"A201*B201","v":3},"2\"","2\"","2\"","2\"","2\"","2\"","2\"","2\"","2\""]
[2,{"$f":"B201+0.5","v":2},1,4,"2\"","2\"","2\"","2\"","2\"","2\"","2\"","2\"","2\""]
[2,2.5,1.25,5,"2\"","2\"","2\"","2\"","2\"","2\"","2\"","2\"","2\""]
[2,3,1.5,6,"2\"","2\"","2\"","2\"","2\"","2\"","2\"","2\"","2\""]
[2,3.5,1.75,7,"2\"","2\"","2\"","2\"","2\"","2\"","2\"","2.5\"","Sign too big.  Use different post."]
[2,4,2,8,"2\"","2\"","2\"","2\"","2\"","2.5\"","2.5\"","2.5\"","Sign too big.  Use different post."]
[2,4.5,2.25,9,"2\"","2\"","2\"","2.5\"","2.5\"","2.5\"","2.5\"","2.5\"","Sign too big.  Use different post."]
[2,5,2.5,10,"2\"","2\"","2.5\"","2.5\"","2.5\"","2.5\"","2.5\"","2.5\"","Sign too big.  Use different post."]
[2,5.5,2.75,11,"2.5\"","2.5\"","2.5\"","2.5\"","2.5\"","2.5\"","2.5\" w/ 2.25\" inside","Sign too big.  Use different post.","Sign too big.  Use different post."]
[2,6,3,12,"2.5\"","2.5\"","2.5\"","2.5\"","2.5\"","2.5\" w/ 2.25\" inside","2.5\" w/ 2.25\" inside","Sign too big.  Use different post.","Sign too big.  Use different post."]
[2,6.5,3.25,13,"2.5\"","2.5\"","2.5\"","2.5\" w/ 2.25\" inside","2.5\" w/ 2.25\" inside","2.5\" w/ 2.25\" inside","2.5\" w/ 2.25\" inside","Sign too big.  Use different post.","Sign too big.  Use different post."]
[2,7,3.5,14,"2.5\"","2.5\"","2.5\" w/ 2.25\" inside","2.5\" w/ 2.25\" inside","2.5\" w/ 2.25\" inside","2.5\" w/ 2.25\" inside","2.5\" w/ 2.25\" inside","Sign too big.  Use different post.","Sign too big.  Use different post."]
[2,7.5,3.75,15,"2.5\"","2.5\" w/ 2.25\" inside","2.5\" w/ 2.25\" inside","2.5\" w/ 2.25\" inside","2.5\" w/ 2.25\" inside","2.5\" w/ 2.25\" inside","Sign too big.  Use different post.","Sign too big.  Use different post.","Sign too big.  Use different post."]
[2,8,4,16,"2.5\" w/ 2.25\" inside","2.5\" w/ 2.25\" inside","2.5\" w/ 2.25\" inside","2.5\" w/ 2.25\" inside","2.5\" w/ 2.25\" inside","2.5\" w/ 2.25\" inside","Sign too big.  Use different post.","Sign too big.  Use different post.","Sign too big.  Use different post."]
[]
[null,null,null,null,7]
["width","height","centroid","area",7,8,9,10,11,12,13,14,15]
[2.5,1,{"$f":"B218/2","v":0.5},{"$f":"A218*B218","v":2.5},"2\"","2\"","2\"","2\"","2\"","2\"","2\"","2\"","2\""]
[2.5,{"$f":"B218+0.5","v":1.5},{"$f":"B219/2","v":0.75},{"$f":"A219*B219","v":3.75},"2\"","2\"","2\"","2\"","2\"","2\"","2\"","2\"","2\""]
[2.5,{"$f":"B219+0.5","v":2},1,5,"2\"","2\"","2\"","2\"","2\"","2\"","2\"","2\"","2\""]
[2.5,2.5,1.25,6.25,"2\"","2\"","2\"","2\"","2\"","2\"","2\"","2\"","2\""]
[2.5,3,1.5,7.5,"2\"","2\"","2\"","2\"","2\"","2\"","2.5\"","2.5\"","2.5\""]
[2.5,3.5,1.75,8.75,"2\"","2\"","2\"","2\"","2.5\"","2.5\"","2.5\"","2.5\"","Sign too big.  Use different post."]
[2.5,4,2,10,"2\"","2\"","2.5\"","2.5\"","2.5\"","2.5\"","2.5\"","2.5\"","Sign too big.  Use different post."]
[2.5,4.5,2.25,11.25,"2\"","2.5\"","2.5\"","2.5\"","2.5\"","2.5\"","2.5\" w/ 2.25\" inside","2.5\" w/ 2.25\" inside","Sign too big.  Use different post."]
[2.5,5,2.5,12.5,"2.5\"","2.5\"","2.5\"","2.5\"","2.5\"","2.5\" w/ 2.25\" inside","2.5\" w/ 2.25\" inside","2.5\" w/ 2.25\" inside","Sign too big.  Use different post."]
[2.5,5.5,2.75,13.75,"2.5\"","2.5\"","2.5\"","2.5\" w/ 2.25\" inside","2.5\" w/ 2.25\" inside","2.5\" w/ 2.25\" inside","2.5\" w/ 2.25\" inside","Sign too big.  Use different post.","Sign too big.  Use different post."]
[2.5,6,3,15,"2.5\"","2.5\"","2.5\" w/ 2.25\" inside","2.5\" w/ 2.25\" inside","2.5\" w/ 2.25\" inside","2.5\" w/ 2.25\" inside","2.5\" w/ 2.25\" inside","Sign too big.  Use different post.","Sign too big.  Use different post."]
[2.5,6.5,3.25,16.25,"2.5\"","2.5\" w/ 2.25\" inside","2.5\" w/ 2.25\" inside","2.5\" w/ 2.25\" inside","2.5\" w/ 2.25\" inside","2.5\" w/ 2.25\" inside","2.5\" w/ 2.25\" inside","Sign too big.  Use different post.","Sign too big.  Use different post."]
[2.5,7,3.5,17.5,"2.5\" w/ 2.25\" inside","2.5\" w/ 2.25\" inside","2.5\" w/ 2.25\" inside","2.5\" w/ 2.25\" inside","2.5\" w/ 2.25\" inside","2.5\" w/ 2.25\" inside","2.5\" w/ 2.25\" inside","Sign too big.  Use different post.","Sign too big.  Use different post."]
[2.5,7.5,3.75,18.75,"2.5\" w/ 2.25\" inside","2.5\" w/ 2.25\" inside","2.5\" w/ 2.25\" inside","2.5\" w/ 2.25\" inside","2.5\" w/ 2.25\" inside","2.5\" w/ 2.25\" inside","Sign too big.  Use different post.","Sign too big.  Use different post.","Sign too big.  Use different post."]
[2.5,8,4,20,"2.5\" w/ 2.25\" inside","2.5\" w/ 2.25\" inside","2.5\" w/ 2.25\" inside","2.5\" w/ 2.25\" inside","2.5\" w/ 2.25\" inside","Sign too big.  Use different post.","Sign too big.  Use different post.","Sign too big.  Use different post.","Sign too big.  Use different post."]
[]
[null,null,null,null,7]
["width","height","centroid","area",7,8,9,10,11,12,13,14,15]
[3,1,{"$f":"B236/2","v":0.5},{"$f":"A236*B236","v":3},"2\"","2\"","2\"","2\"","2\"","2\"","2\"","2\"","2\""]
[3,{"$f":"B236+0.5","v":1.5},{"$f":"B237/2","v":0.75},{"$f":"A237*B237","v":4.5},"2\"","2\"","2\"","2\"","2\"","2\"","2\"","2\"","2\""]
[3,{"$f":"B237+0.5","v":2},1,6,"2\"","2\"","2\"","2\"","2\"","2\"","2\"","2\"","2\""]
[3,2.5,1.25,7.5,"2\"","2\"","2\"","2\"","2\"","2\"","2.5\"","2.5\"","2.5\""]
[3,3,1.5,9,"2\"","2\"","2\"","2\"","2.5\"","2.5\"","2.5\"","2.5\"","2.5\""]
[3,3.5,1.75,10.5,"2\"","2\"","2.5\"","2.5\"","2.5\"","2.5\"","2.5\"","2.5\"","Sign too big.  Use different post."]
[3,4,2,12,"2.5\"","2.5\"","2.5\"","2.5\"","2.5\"","2.5\"","2.5\" w/ 2.25\" inside","2.5\" w/ 2.25\" inside","Sign too big.  Use different post."]
[3,4.5,2.25,13.5,"2.5\"","2.5\"","2.5\"","2.5\"","2.5\" w/ 2.25\" inside","2.5\" w/ 2.25\" inside","2.5\" w/ 2.25\" inside","2.5\" w/ 2.25\" inside","Sign too big.  Use different post."]
[3,5,2.5,15,"2.5\"","2.5\"","2.5\" w/ 2.25\" inside","2.5\" w/ 2.25\" inside","2.5\" w/ 2.25\" inside","2.5\" w/ 2.25\" inside","2.5\" w/ 2.25\" inside","2.5\" w/ 2.25\" inside","Sign too big.  Use different post."]
[3,5.5,2.75,16.5,"2.5\"","2.5\" w/ 2.25\" inside","2.5\" w/ 2.25\" inside","2.5\" w/ 2.25\" inside","2.5\" w/ 2.25\" inside","2.5\" w/ 2.25\" inside","2.5\" w/ 2.25\" inside","Sign too big.  Use different post.","Sign too big.  Use different post."]
[3,6,3,18,"2.5\" w/ 2.25\" inside","2.5\" w/ 2.25\" inside","2.5\" w/ 2.25\" inside","2.5\" w/ 2.25\" inside","2.5\" w/ 2.25\" inside","2.5\" w/ 2.25\" inside","2.5\" w/ 2.25\" inside","Sign too big.  Use different post.","Sign too big.  Use different post."]
[3,6.5,3.25,19.5,"2.5\" w/ 2.25\" inside","2.5\" w/ 2.25\" inside","2.5\" w/ 2.25\" inside","2.5\" w/ 2.25\" inside","2.5\" w/ 2.25\" inside","2.5\" w/ 2.25\" inside","Sign too big.  Use different post.","Sign too big.  Use different post.","Sign too big.  Use different post."]
[3,7,3.5,21,"2.5\" w/ 2.25\" inside","2.5\" w/ 2.25\" inside","2.5\" w/ 2.25\" inside","2.5\" w/ 2.25\" inside","2.5\" w/ 2.25\" inside","Sign too big.  Use different post.","Sign too big.  Use different post.","Sign too big.  Use different post.","Sign too big.  Use different post."]
[3,7.5,3.75,22.5,"2.5\" w/ 2.25\" inside","2.5\" w/ 2.25\" inside","2.5\" w/ 2.25\" inside","Sign too big.  Use different post.","Sign too big.  Use different post.","Sign too big.  Use different post.","Sign too big.  Use different post.","Sign too big.  Use different post.","Sign too big.  Use different post."]
[3,8,4,24,"2.5\" w/ 2.25\" inside","2.5\" w/ 2.25\" inside","Sign too big.  Use different post.","Sign too big.  Use different post.","Sign too big.  Use different post.","Sign too big.  Use different post.","Sign too big.  Use different post.","Sign too big.  Use different post.","Sign too big.  Use different post."]
[]
[null,null,null,null,7]
["width","height","centroid","area",7,8,9,10,11,12,13,14,15]
[3.5,1,{"$f":"B254/2","v":0.5},{"$f":"A254*B254","v":3.5},"2\"","2\"","2\"","2\"","2\"","2\"","2\"","2\"","2\""]
[3.5,{"$f":"B254+0.5","v":1.5},{"$f":"B255/2","v":0.75},{"$f":"A255*B255","v":5.25},"2\"","2\"","2\"","2\"","2\"","2\"","2\"","2\"","2\""]
[3.5,{"$f":"B255+0.5","v":2},1,7,"2\"","2\"","2\"","2\"","2\"","2\"","2\"","2\"","2.5\""]
[3.5,2.5,1.25,8.75,"2\"","2\"","2\"","2\"","2.5\"","2.5\"","2.5\"","2.5\"","2.5\""]
[3.5,3,1.5,10.5,"2\"","2\"","2.5\"","2.5\"","2.5\"","2.5\"","2.5\"","2.5\"","2.5\" w/ 2.25\" inside"]
[3.5,3.5,1.75,12.25,"2.5\"","2.5\"","2.5\"","2.5\"","2.5\"","2.5\"","2.5\" w/ 2.25\" inside","2.5\" w/ 2.25\" inside","Sign too big.  Use different post."]
[3.5,4,2,14,"2.5\"","2.5\"","2.5\"","2.5\"","2.5\" w/ 2.25\" inside","2.5\" w/ 2.25\" inside","2.5\" w/ 2.25\" inside","2.5\" w/ 2.25\" inside","Sign too big.  Use different post."]
[3.5,4.5,2.25,15.75,"2.5\"","2.5\"","2.5\" w/ 2.25\" inside","2.5\" w/ 2.25\" inside","2.5\" w/ 2.25\" inside","2.5\" w/ 2.25\" inside","2.5\" w/ 2.25\" inside","2.5\" w/ 2.25\" inside","Sign too big.  Use different post."]
[3.5,5,2.5,17.5,"2.5\"","2.5\" w/ 2.25\" inside","2.5\" w/ 2.25\" inside","2.5\" w/ 2.25\" inside","2.5\" w/ 2.25\" inside","2.5\" w/ 2.25\" inside","2.5\" w/ 2.25\" inside","2.5\" w/ 2.25\" inside","Sign too big.  Use different post."]
[3.5,5.5,2.75,19.25,"2.5\" w/ 2.25\" inside","2.5\" w/ 2.25\" inside","2.5\" w/ 2.25\" inside","2.5\" w/ 2.25\" inside","2.5\" w/ 2.25\" inside","2.5\" w/ 2.25\" inside","2.5\" w/ 2.25\" inside","Sign too big.  Use different post.","Sign too big.  Use different post."]
[3.5,6,3,21,"2.5\" w/ 2.25\" inside","2.5\" w/ 2.25\" inside","2.5\" w/ 2.25\" inside","2.5\" w/ 2.25\" inside","2.5\" w/ 2.25\" inside","Sign too big.  Use different post.","Sign too big.  Use different post.","Sign too big.  Use different post.","Sign too big.  Use different post."]
[3.5,6.5,3.25,22.75,"2.5\" w/ 2.25\" inside","2.5\" w/ 2.25\" inside","2.5\" w/ 2.25\" inside","2.5\" w/ 2.25\" inside","Sign too big.  Use different post.","Sign too big.  Use different post.","Sign too big.  Use different post.","Sign too big.  Use different post.","Sign too big.  Use different post."]
[3.5,7,3.5,24.5,"2.5\" w/ 2.25\" inside","2.5\" w/ 2.25\" inside","2.5\" w/ 2.25\" inside","Sign too big.  Use different post.","Sign too big.  Use different post.","Sign too big.  Use different post.","Sign too big.  Use different post.","Sign too big.  Use different post.","Sign too big.  Use different post."]
[3.5,7.5,3.75,26.25,"2.5\" w/ 2.25\" inside","Sign too big.  Use different post.","Sign too big.  Use different post.","Sign too big.  Use different post.","Sign too big.  Use different post.","Sign too big.  Use different post.","Sign too big.  Use different post.","Sign too big.  Use different post.","Sign too big.  Use different post."]
[3.5,8,4,28,"2.5\" w/ 2.25\" inside","Sign too big.  Use different post.","Sign too big.  Use different post.","Sign too big.  Use different post.","Sign too big.  Use different post.","Sign too big.  Use different post.","Sign too big.  Use different post.","Sign too big.  Use different post.","Sign too big.  Use different post."]
[]
["DOUBLE POST - 5' MOUNTING HEIGHT"]
[]
[null,null,null,null,5]
["width","height","centroid","area",5,6,7,8,9,10,11,12,13,14,15]
[4,1,{"$f":"B274/2","v":0.5},{"$f":"A274*B274","v":4},"2\"","2\"","2\"","2\"","2\"","2\"","2\"","2\"","2\"","2\"","2\""]
[4,{"$f":"B274+0.5","v":1.5},{"$f":"B275/2","v":0.75},{"$f":"A275*B275","v":6},"2\"","2\"","2\"","2\"","2\"","2\"","2\"","2\"","2\"","2\"","2\""]
[4,{"$f":"B275+0.5","v":2},1,8,"2\"","2\"","2\"","2\"","2\"","2\"","2\"","2\"","2\"","2\"","2\""]
[4,2.5,1.25,10,"2\"","2\"","2\"","2\"","2\"","2\"","2\"","2\"","2\"","2\"","2\""]
[4,3,1.5,12,"2\"","2\"","2\"","2\"","2\"","2\"","2\"","2\"","2\"","2\"","2\""]
[4,3.5,1.75,14,"2\"","2\"","2\"","2\"","2\"","2\"","2\"","2\"","2\"","2.5\"","2.5\""]
[4,4,2,16,"2\"","2\"","2\"","2\"","2\"","2\"","2\"","2.5\"","2.5\"","2.5\"","2.5\""]
[4,4.5,2.25,18,"2\"","2\"","2\"","2\"","2\"","2.5\"","2.5\"","2.5\"","2.5\"","2.5\"","2.5\""]
[4,5,2.5,20,"2\"","2\"","2\"","2\"","2.5\"","2.5\"","2.5\"","2.5\"","2.5\"","2.5\"","2.5\" w/ 2.25\" inside"]
[4,{"$f":"B282+0.5","v":5.5},2.75,22,"2\"","2\"","2.5\"","2.5\"","2.5\"","2.5\"","2.5\"","2.5\"","2.5\" w/ 2.25\" inside","2.5\" w/ 2.25\" inside","2.5\" w/ 2.25\" inside"]
[4,6,3,24,"2\"","2.5\"","2.5\"","2.5\"","2.5\"","2.5\"","2.5\"","2.5\" w/ 2.25\" inside","2.5\" w/ 2.25\" inside","2.5\" w/ 2.25\" inside","2.5\" w/ 2.25\" inside"]
[4,6.5,3.25,26,"2.5\"","2.5\"","2.5\"","2.5\"","2.5\"","2.5\" w/ 2.25\" inside","2.5\" w/ 2.25\" inside","2.5\" w/ 2.25\" inside","2.5\" w/ 2.25\" inside","2.5\" w/ 2.25\" inside","2.5\" w/ 2.25\" inside"]
[4,7,3.5,28,"2.5\"","2.5\"","2.5\"","2.5\"","2.5\" w/ 2.25\" inside","2.5\" w/ 2.25\" inside","2.5\" w/ 2.25\" inside","2.5\" w/ 2.25\" inside","2.5\" w/ 2.25\" inside","2.5\" w/ 2.25\" inside","2.5\" w/ 2.25\" inside"]
[4,{"$f":"B286+0.5","v":7.5},3.75,30,"2.5\"","2.5\"","2.5\"","2.5\" w/ 2.25\" inside","2.5\" w/ 2.25\" inside","2.5\" w/ 2.25\" inside","2.5\" w/ 2.25\" inside","2.5\" w/ 2.25\" inside","2.5\" w/ 2.25\" inside","2.5\" w/ 2.25\" inside","2.5\" w/ 2.25\" inside"]
[4,8,4,32,"2.5\"","2.5\"","2.5\" w/ 2.25\" inside","2.5\" w/ 2.25\" inside","2.5\" w/ 2.25\" inside","2.5\" w/ 2.25\" inside","2.5\" w/ 2.25\" inside","2.5\" w/ 2.25\" inside","2.5\" w/ 2.25\" inside","Sign too big.  Use different post.","Sign too big.  Use different post."]
[]
[null,null,null,null,5]
["width","height","centroid","area",5,6,7,8,9,10,11,12,13,14,15]
[4.5,1,{"$f":"B292/2","v":0.5},{"$f":"A292*B292","v":4.5},"2\"","2\"","2\"","2\"","2\"","2\"","2\"","2\"","2\"","2\"","2\""]
[4.5,{"$f":"B292+0.5","v":1.5},{"$f":"B293/2","v":0.75},{"$f":"A293*B293","v":6.75},"2\"","2\"","2\"","2\"","2\"","2\"","2\"","2\"","2\"","2\"","2\""]
[4.5,{"$f":"B293+0.5","v":2},1,9,"2\"","2\"","2\"","2\"","2\"","2\"","2\"","2\"","2\"","2\"","2\""]
[4.5,2.5,1.25,11.25,"2\"","2\"","2\"","2\"","2\"","2\"","2\"","2\"","2\"","2\"","2\""]
[4.5,3,1.5,13.5,"2\"","2\"","2\"","2\"","2\"","2\"","2\"","2\"","2\"","2\"","2.5\""]
[4.5,3.5,1.75,15.75,"2\"","2\"","2\"","2\"","2\"","2\"","2\"","2.5\"","2.5\"","2.5\"","2.5\""]
[4.5,4,2,18,"2\"","2\"","2\"","2\"","2\"","2.5\"","2.5\"","2.5\"","2.5\"","2.5\"","2.5\""]
[4.5,4.5,2.25,20.25,"2\"","2\"","2\"","2\"","2.5\"","2.5\"","2.5\"","2.5\"","2.5\"","2.5\"","2.5\" w/ 2.25\" inside"]
[4.5,5,2.5,22.5,"2\"","2\"","2\"","2.5\"","2.5\"","2.5\"","2.5\"","2.5\"","2.5\" w/ 2.25\" inside","2.5\" w/ 2.25\" inside","2.5\" w/ 2.25\" inside"]
[4.5,5.5,2.75,24.75,"2\"","2.5\"","2.5\"","2.5\"","2.5\"","2.5\"","2.5\" w/ 2.25\" inside","2.5\" w/ 2.25\" inside","2.5\" w/ 2.25\" inside","2.5\" w/ 2.25\" inside","2.5\" w/ 2.25\" inside"]
[4.5,6,3,27,"2.5\"","2.5\"","2.5\"","2.5\"","2.5\"","2.5\" w/ 2.25\" inside","2.5\" w/ 2.25\" inside","2.5\" w/ 2.25\" inside","2.5\" w/ 2.25\" inside","2.5\" w/ 2.25\" inside","2.5\" w/ 2.25\" inside"]
[4.5,6.5,3.25,29.25,"2.5\"","2.5\"","2.5\"","2.5\"","2.5\" w/ 2.25\" inside","2.5\" w/ 2.25\" inside","2.5\" w/ 2.25\" inside","2.5\" w/ 2.25\" inside","2.5\" w/ 2.25\" inside","2.5\" w/ 2.25\" inside","2.5\" w/ 2.25\" inside"]
[4.5,7,3.5,31.5,"2.5\"","2.5\"","2.5\"","2.5\" w/ 2.25\" inside","2.5\" w/ 2.25\" inside","2.5\" w/ 2.25\" inside","2.5\" w/ 2.25\" inside","2.5\" w/ 2.25\" inside","2.5\" w/ 2.25\" inside","2.5\" w/ 2.25\" inside","Sign too big.  Use different post."]
[4.5,7.5,3.75,33.75,"2.5\"","2.5\"","2.5\" w/ 2.25\" inside","2.5\" w/ 2.25\" inside","2.5\" w/ 2.25\" inside","2.5\" w/ 2.25\" inside","2.5\" w/ 2.25\" inside","2.5\" w/ 2.25\" inside","2.5\" w/ 2.25\" inside","Sign too big.  Use different post.","Sign too big.  Use different post."]
[4.5,8,4,36,"2.5\"","2.5\" w/ 2.25\" inside","2.5\" w/ 2.25\" inside","2.5\" w/ 2.25\" inside","2.5\" w/ 2.25\" inside","2.5\" w/ 2.25\" inside","2.5\" w/ 2.25\" inside","2.5\" w/ 2.25\" inside","Sign too big.  Use different post.","Sign too big.  Use different post.","Sign too big.  Use different post."]
[]
[null,null,null,null,5]
["width","height","centroid","area",5,6,7,8,9,10,11,12,13,14,15]
[5,1,{"$f":"B310/2","v":0.5},{"$f":"A310*B310","v":5},"2\"","2\"","2\"","2\"","2\"","2\"","2\"","2\"","2\"","2\"","2\""]
[5,{"$f":"B310+0.5","v":1.5},{"$f":"B311/2","v":0.75},{"$f":"A311*B311","v":7.5},"2\"","2\"","2\"","2\"","2\"","2\"","2\"","2\"","2\"","2\"","2\""]
[5,{"$f":"B311+0.5","v":2},1,10,"2\"","2\"","2\"","2\"","2\"","2\"","2\"","2\"","2\"","2\"","2\""]
[5,2.5,1.25,12.5,"2\"","2\"","2\"","2\"","2\"","2\"","2\"","2\"","2\"","2\"","2\""]
[5,3,1.5,15,"2\"","2\"","2\"","2\"","2\"","2\"","2\"","2\"","2.5\"","2.5\"","2.5\""]
[5,3.5,1.75,17.5,"2\"","2\"","2\"","2\"","2\"","2\"","2.5\"","2.5\"","2.5\"","2.5\"","2.5\""]
[5,4,2,20,"2\"","2\"","2\"","2\"","2.5\"","2.5\"","2.5\"","2.5\"","2.5\"","2.5\"","2.5\" w/ 2.25\" inside"]
[5,4.5,2.25,22.5,"2\"","2\"","2\"","2.5\"","2.5\"","2.5\"","2.5\"","2.5\"","2.5\" w/ 2.25\" inside","2.5\" w/ 2.25\" inside","2.5\" w/ 2.25\" inside"]
[5,5,2.5,25,"2\"","2\"","2.5\"","2.5\"","2.5\"","2.5\"","2.5\"","2.5\" w/ 2.25\" inside","2.5\" w/ 2.25\" inside","2.5\" w/ 2.25\" inside","2.5\" w/ 2.25\" inside"]
[5,5.5,2.75,27.5,"2\"","2.5\"","2.5\"","2.5\"","2.5\"","2.5\" w/ 2.25\" inside","2.5\" w/ 2.25\" inside","2.5\" w/ 2.25\" inside","2.5\" w/ 2.25\" inside","2.5\" w/ 2.25\" inside","2.5\" w/ 2.25\" inside"]
[5,6,3,30,"2.5\"","2.5\"","2.5\"","2.5\"","2.5\" w/ 2.25\" inside","2.5\" w/ 2.25\" inside","2.5\" w/ 2.25\" inside","2.5\" w/ 2.25\" inside","2.5\" w/ 2.25\" inside","2.5\" w/ 2.25\" inside","2.5\" w/ 2.25\" inside"]
[5,6.5,3.25,32.5,"2.5\"","2.5\"","2.5\"","2.5\" w/ 2.25\" inside","2.5\" w/ 2.25\" inside","2.5\" w/ 2.25\" inside","2.5\" w/ 2.25\" inside","2.5\" w/ 2.25\" inside","2.5\" w/ 2.25\" inside","2.5\" w/ 2.25\" inside","Sign too big.  Use different post."]
[5,7,3.5,35,"2.5\"","2.5\"","2.5\" w/ 2.25\" inside","2.5\" w/ 2.25\" inside","2.5\" w/ 2.25\" inside","2.5\" w/ 2.25\" inside","2.5\" w/ 2.25\" inside","2.5\" w/ 2.25\" inside","Sign too big.  Use different post.","Sign too big.  Use different post.","Sign too big.  Use different post."]
[5,7.5,3.75,37.5,"2.5\"","2.5\" w/ 2.25\" inside","2.5\" w/ 2.25\" inside","2.5\" w/ 2.25\" inside","2.5\" w/ 2.25\" inside","2.5\" w/ 2.25\" inside","2.5\" w/ 2.25\" inside","2.5\" w/ 2.25\" inside","Sign too big.  Use different post.","Sign too big.  Use different post.","Sign too big.  Use different post."]
[5,8,4,40,"2.5\" w/ 2.25\" inside","2.5\" w/ 2.25\" inside","2.5\" w/ 2.25\" inside","2.5\" w/ 2.25\" inside","2.5\" w/ 2.25\" inside","2.5\" w/ 2.25\" inside","2.5\" w/ 2.25\" inside","Sign too big.  Use different post.","Sign too big.  Use different post.","Sign too big.  Use different post.","Sign too big.  Use different post."]
[]
[null,null,null,null,5]
["width","height","centroid","area",5,6,7,8,9,10,11,12,13,14,15]
[5.5,1,{"$f":"B328/2","v":0.5},{"$f":"A328*B328","v":5.5},"2\"","2\"","2\"","2\"","2\"","2\"","2\"","2\"","2\"","2\"","2\""]
[5.5,{"$f":"B328+0.5","v":1.5},{"$f":"B329/2","v":0.75},{"$f":"A329*B329","v":8.25},"2\"","2\"","2\"","2\"","2\"","2\"","2\"","2\"","2\"","2\"","2\""]
[5.5,{"$f":"B329+0.5","v":2},1,11,"2\"","2\"","2\"","2\"","2\"","2\"","2\"","2\"","2\"","2\"","2\""]
[5.5,2.5,1.25,13.75,"2\"","2\"","2\"","2\"","2\"","2\"","2\"","2\"","2\"","2\"","2.5\""]
[5.5,3,1.5,16.5,"2\"","2\"","2\"","2\"","2\"","2\"","2\"","2.5\"","2.5\"","2.5\"","2.5\""]
[5.5,3.5,1.75,19.25,"2\"","2\"","2\"","2\"","2\"","2.5\"","2.5\"","2.5\"","2.5\"","2.5\"","2.5\" w/ 2.25\" inside"]
[5.5,4,2,22,"2\"","2\"","2\"","2.5\"","2.5\"","2.5\"","2.5\"","2.5\"","2.5\"","2.5\" w/ 2.25\" inside","2.5\" w/ 2.25\" inside"]
[5.5,4.5,2.25,24.75,"2\"","2\"","2.5\"","2.5\"","2.5\"","2.5\"","2.5\"","2.5\" w/ 2.25\" inside","2.5\" w/ 2.25\" inside","2.5\" w/ 2.25\" inside","2.5\" w/ 2.25\" inside"]
[5.5,5,2.5,27.5,"2\"","2.5\"","2.5\"","2.5\"","2.5\"","2.5\"","2.5\" w/ 2.25\" inside","2.5\" w/ 2.25\" inside","2.5\" w/ 2.25\" inside","2.5\" w/ 2.25\" inside","2.5\" w/ 2.25\" inside"]
[5.5,5.5,2.75,30.25,"2.5\"","2.5\"","2.5\"","2.5\"","2.5\" w/ 2.25\" inside","2.5\" w/ 2.25\" inside","2.5\" w/ 2.25\" inside","2.5\" w/ 2.25\" inside","2.5\" w/ 2.25\" inside","2.5\" w/ 2.25\" inside","2.5\" w/ 2.25\" inside"]
[5.5,6,3,33,"2.5\"","2.5\"","2.5\"","2.5\" w/ 2.25\" inside","2.5\" w/ 2.25\" inside","2.5\" w/ 2.25\" inside","2.5\" w/ 2.25\" inside","2.5\" w/ 2.25\" inside","2.5\" w/ 2.25\" inside","2.5\" w/ 2.25\" inside","Sign too big.  Use different post."]
[5.5,6.5,3.25,35.75,"2.5\"","2.5\"","2.5\" w/ 2.25\" inside","2.5\" w/ 2.25\" inside","2.5\" w/ 2.25\" inside","2.5\" w/ 2.25\" inside","2.5\" w/ 2.25\" inside","2.5\" w/ 2.25\" inside","2.5\" w/ 2.25\" inside","Sign too big.  Use different post.","Sign too big.  Use different post."]
[5.5,7,3.5,38.5,"2.5\"","2.5\" w/ 2.25\" inside","2.5\" w/ 2.25\" inside","2.5\" w/ 2.25\" inside","2.5\" w/ 2.25\" inside","2.5\" w/ 2.25\" inside","2.5\" w/ 2.25\" inside","2.5\" w/ 2.25\" inside","Sign too big.  Use different post.","Sign too big.  Use different post.","Sign too big.  Use different post."]
[5.5,7.5,3.75,41.25,"2.5\" w/ 2.25\" inside","2.5\" w/ 2.25\" inside","2.5\" w/ 2.25\" inside","2.5\" w/ 2.25\" inside","2.5\" w/ 2.25\" inside","2.5\" w/ 2.25\" inside","2.5\" w/ 2.25\" inside","Sign too big.  Use different post.","Sign too big.  Use different post.","Sign too big.  Use different post.","Sign too big.  Use different post."]
[5.5,8,4,44,"2.5\" w/ 2.25\" inside","2.5\" w/ 2.25\" inside","2.5\" w/ 2.25\" inside","2.5\" w/ 2.25\" inside","2.5\" w/ 2.25\" inside","Sign too big.  Use different post.","Sign too big.  Use different post.","Sign too big.  Use different post.","Sign too big.  Use different post.","Sign too big.  Use different post.","Sign too big.  Use different post."]
[]
[null,null,null,null,5]
["width","height","centroid","area",5,6,7,8,9,10,11,12,13,14,15]
[6,1,{"$f":"B346/2","v":0.5},{"$f":"A346*B346","v":6},"2\"","2\"","2\"","2\"","2\"","2\"","2\"","2\"","2\"","2\"","2\""]
[6,{"$f":"B346+0.5","v":1.5},{"$f":"B347/2","v":0.75},{"$f":"A347*B347","v":9},"2\"","2\"","2\"","2\"","2\"","2\"","2\"","2\"","2\"","2\"","2\""]
[6,{"$f":"B347+0.5","v":2},1,12,"2\"","2\"","2\"","2\"","2\"","2\"","2\"","2\"","2\"","2\"","2\""]
[6,2.5,1.25,15,"2\"","2\"","2\"","2\"","2\"","2\"","2\"","2\"","2\"","2.5\"","2.5\""]
[6,3,1.5,18,"2\"","2\"","2\"","2\"","2\"","2\"","2.5\"","2.5\"","2.5\"","2.5\"","2.5\""]
[6,3.5,1.75,21,"2\"","2\"","2\"","2\"","2.5\"","2.5\"","2.5\"","2.5\"","2.5\"","2.5\"","2.5\" w/ 2.25\" inside"]
[6,4,2,24,"2\"","2\"","2.5\"","2.5\"","2.5\"","2.5\"","2.5\"","2.5\"","2.5\" w/ 2.25\" inside","2.5\" w/ 2.25\" inside","2.5\" w/ 2.25\" inside"]
[6,4.5,2.25,27,"2\"","2.5\"","2.5\"","2.5\"","2.5\"","2.5\"","2.5\" w/ 2.25\" inside","2.5\" w/ 2.25\" inside","2.5\" w/ 2.25\" inside","2.5\" w/ 2.25\" inside","2.5\" w/ 2.25\" inside"]
[6,5,2.5,30,"2.5\"","2.5\"","2.5\"","2.5\"","2.5\" w/ 2.25\" inside","2.5\" w/ 2.25\" inside","2.5\" w/ 2.25\" inside","2.5\" w/ 2.25\" inside","2.5\" w/ 2.25\" inside","2.5\" w/ 2.25\" inside","2.5\" w/ 2.25\" inside"]
[6,5.5,2.75,33,"2.5\"","2.5\"","2.5\"","2.5\" w/ 2.25\" inside","2.5\" w/ 2.25\" inside","2.5\" w/ 2.25\" inside","2.5\" w/ 2.25\" inside","2.5\" w/ 2.25\" inside","2.5\" w/ 2.25\" inside","2.5\" w/ 2.25\" inside","Sign too big.  Use different post."]
[6,6,3,36,"2.5\"","2.5\"","2.5\" w/ 2.25\" inside","2.5\" w/ 2.25\" inside","2.5\" w/ 2.25\" inside","2.5\" w/ 2.25\" inside","2.5\" w/ 2.25\" inside","2.5\" w/ 2.25\" inside","2.5\" w/ 2.25\" inside","Sign too big.  Use different post.","Sign too big.  Use different post."]
[6,6.5,3.25,39,"2.5\"","2.5\" w/ 2.25\" inside","2.5\" w/ 2.25\" inside","2.5\" w/ 2.25\" inside","2.5\" w/ 2.25\" inside","2.5\" w/ 2.25\" inside","2.5\" w/ 2.25\" inside","2.5\" w/ 2.25\" inside","Sign too big.  Use different post.","Sign too big.  Use different post.","Sign too big.  Use different post."]
[6,7,3.5,42,"2.5\" w/ 2.25\" inside","2.5\" w/ 2.25\" inside","2.5\" w/ 2.25\" inside","2.5\" w/ 2.25\" inside","2.5\" w/ 2.25\" inside","2.5\" w/ 2.25\" inside","2.5\" w/ 2.25\" inside","Sign too big.  Use different post.","Sign too big.  Use different post.","Sign too big.  Use different post.","Sign too big.  Use different post."]
[6,7.5,3.75,45,"2.5\" w/ 2.25\" inside","2.5\" w/ 2.25\" inside","2.5\" w/ 2.25\" inside","2.5\" w/ 2.25\" inside","2.5\" w/ 2.25\" inside","Sign too big.  Use different post.","Sign too big.  Use different post.","Sign too big.  Use different post.","Sign too big.  Use different post.","Sign too big.  Use different post.","Sign too big.  Use different post."]
[6,8,4,48,"2.5\" w/ 2.25\" inside","2.5\" w/ 2.25\" inside","2.5\" w/ 2.25\" inside","2.5\" w/ 2.25\" inside","Sign too big.  Use different post.","Sign too big.  Use different post.","Sign too big.  Use different post.","Sign too big.  Use different post.","Sign too big.  Use different post.","Sign too big.  Use different post.","Sign too big.  Use different post."]
[]
[null,null,null,null,5]
["width","height","centroid","area",5,6,7,8,9,10,11,12,13,14,15]
[6.5,1,{"$f":"B364/2","v":0.5},{"$f":"A364*B364","v":6.5},"2\"","2\"","2\"","2\"","2\"","2\"","2\"","2\"","2\"","2\"","2\""]
[6.5,{"$f":"B364+0.5","v":1.5},{"$f":"B365/2","v":0.75},{"$f":"A365*B365","v":9.75},"2\"","2\"","2\"","2\"","2\"","2\"","2\"","2\"","2\"","2\"","2\""]
[6.5,{"$f":"B365+0.5","v":2},1,13,"2\"","2\"","2\"","2\"","2\"","2\"","2\"","2\"","2\"","2\"","2\""]
[6.5,2.5,1.25,16.25,"2\"","2\"","2\"","2\"","2\"","2\"","2\"","2.5\"","2.5\"","2.5\"","2.5\""]
[6.5,3,1.5,19.5,"2\"","2\"","2\"","2\"","2\"","2.5\"","2.5\"","2.5\"","2.5\"","2.5\"","2.5\""]
[6.5,3.5,1.75,22.75,"2\"","2\"","2\"","2.5\"","2.5\"","2.5\"","2.5\"","2.5\"","2.5\"","2.5\" w/ 2.25\" inside","2.5\" w/ 2.25\" inside"]
[6.5,4,2,26,"2\"","2\"","2.5\"","2.5\"","2.5\"","2.5\"","2.5\"","2.5\" w/ 2.25\" inside","2.5\" w/ 2.25\" inside","2.5\" w/ 2.25\" inside","2.5\" w/ 2.25\" inside"]
[6.5,4.5,2.25,29.25,"2\"","2.5\"","2.5\"","2.5\"","2.5\"","2.5\" w/ 2.25\" inside","2.5\" w/ 2.25\" inside","2.5\" w/ 2.25\" inside","2.5\" w/ 2.25\" inside","2.5\" w/ 2.25\" inside","2.5\" w/ 2.25\" inside"]
[6.5,5,2.5,32.5,"2.5\"","2.5\"","2.5\"","2.5\" w/ 2.25\" inside","2.5\" w/ 2.25\" inside","2.5\" w/ 2.25\" inside","2.5\" w/ 2.25\" inside","2.5\" w/ 2.25\" inside","2.5\" w/ 2.25\" inside","2.5\" w/ 2.25\" inside","Sign too big.  Use different post."]
[6.5,5.5,2.75,35.75,"2.5\"","2.5\"","2.5\" w/ 2.25\" inside","2.5\" w/ 2.25\" inside","2.5\" w/ 2.25\" inside","2.5\" w/ 2.25\" inside","2.5\" w/ 2.25\" inside","2.5\" w/ 2.25\" inside","2.5\" w/ 2.25\" inside","Sign too big.  Use different post.","Sign too big.  Use different post."]
[6.5,6,3,39,"2.5\"","2.5\" w/ 2.25\" inside","2.5\" w/ 2.25\" inside","2.5\" w/ 2.25\" inside","2.5\" w/ 2.25\" inside","2.5\" w/ 2.25\" inside","2.5\" w/ 2.25\" inside","2.5\" w/ 2.25\" inside","Sign too big.  Use different post.","Sign too big.  Use different post.","Sign too big.  Use different post."]
[6.5,6.5,3.25,42.25,"2.5\" w/ 2.25\" inside","2.5\" w/ 2.25\" inside","2.5\" w/ 2.25\" inside","2.5\" w/ 2.25\" inside","2.5\" w/ 2.25\" inside","2.5\" w/ 2.25\" inside","2.5\" w/ 2.25\" inside","Sign too big.  Use different post.","Sign too big.  Use different post.","Sign too big.  Use different post.","Sign too big.  Use different post."]
[6.5,7,3.5,45.5,"2.5\" w/ 2.25\" inside","2.5\" w/ 2.25\" inside","2.5\" w/ 2.25\" inside","2.5\" w/ 2.25\" inside","2.5\" w/ 2.25\" inside","Sign too big.  Use different post.","Sign too big.  Use different post.","Sign too big.  Use different post.","Sign too big.  Use different post.","Sign too big.  Use different post.","Sign too big.  Use different post."]
[6.5,7.5,3.75,48.75,"2.5\" w/ 2.25\" inside","2.5\" w/ 2.25\" inside","2.5\" w/ 2.25\" inside","2.5\" w/ 2.25\" inside","Sign too big.  Use different post.","Sign too big.  Use different post.","Sign too big.  Use different post.","Sign too big.  Use different post.","Sign too big.  Use different post.","Sign too big.  Use different post.","Sign too big.  Use different post."]
[6.5,8,4,52,"2.5\" w/ 2.25\" inside","2.5\" w/ 2.25\" inside","2.5\" w/ 2.25\" inside","Sign too big.  Use different post.","Sign too big.  Use different post.","Sign too big.  Use different post.","Sign too big.  Use different post.","Sign too big.  Use different post.","Sign too big.  Use different post.","Sign too big.  Use different post.","Sign too big.  Use different post."]
[]
[null,null,null,null,5]
["width","height","centroid","area",5,6,7,8,9,10,11,12,13,14,15]
[7,1,{"$f":"B382/2","v":0.5},{"$f":"A382*B382","v":7},"2\"","2\"","2\"","2\"","2\"","2\"","2\"","2\"","2\"","2\"","2\""]
[7,{"$f":"B382+0.5","v":1.5},{"$f":"B383/2","v":0.75},{"$f":"A383*B383","v":10.5},"2\"","2\"","2\"","2\"","2\"","2\"","2\"","2\"","2\"","2\"","2\""]
[7,{"$f":"B383+0.5","v":2},1,14,"2\"","2\"","2\"","2\"","2\"","2\"","2\"","2\"","2\"","2\"","2.5\""]
[7,2.5,1.25,17.5,"2\"","2\"","2\"","2\"","2\"","2\"","2.5\"","2.5\"","2.5\"","2.5\"","2.5\""]
[7,3,1.5,21,"2\"","2\"","2\"","2\"","2.5\"","2.5\"","2.5\"","2.5\"","2.5\"","2.5\"","2.5\" w/ 2.25\" inside"]
[7,3.5,1.75,24.5,"2\"","2\"","2.5\"","2.5\"","2.5\"","2.5\"","2.5\"","2.5\"","2.5\" w/ 2.25\" inside","2.5\" w/ 2.25\" inside","2.5\" w/ 2.25\" inside"]
[7,4,2,28,"2\"","2.5\"","2.5\"","2.5\"","2.5\"","2.5\"","2.5\" w/ 2.25\" inside","2.5\" w/ 2.25\" inside","2.5\" w/ 2.25\" inside","2.5\" w/ 2.25\" inside","2.5\" w/ 2.25\" inside"]
[7,4.5,2.25,31.5,"2.5\"","2.5\"","2.5\"","2.5\"","2.5\" w/ 2.25\" inside","2.5\" w/ 2.25\" inside","2.5\" w/ 2.25\" inside","2.5\" w/ 2.25\" inside","2.5\" w/ 2.25\" inside","2.5\" w/ 2.25\" inside","2.5\" w/ 2.25\" inside"]
[7,5,2.5,35,"2.5\"","2.5\"","2.5\"","2.5\" w/ 2.25\" inside","2.5\" w/ 2.25\" inside","2.5\" w/ 2.25\" inside","2.5\" w/ 2.25\" inside","2.5\" w/ 2.25\" inside","2.5\" w/ 2.25\" inside","2.5\" w/ 2.25\" inside","Sign too big.  Use different post."]
[7,5.5,2.75,38.5,"2.5\"","2.5\"","2.5\" w/ 2.25\" inside","2.5\" w/ 2.25\" inside","2.5\" w/ 2.25\" inside","2.5\" w/ 2.25\" inside","2.5\" w/ 2.25\" inside","2.5\" w/ 2.25\" inside","2.5\" w/ 2.25\" inside","Sign too big.  Use different post.","Sign too big.  Use different post."]
[7,6,3,42,"2.5\"","2.5\" w/ 2.25\" inside","2.5\" w/ 2.25\" inside","2.5\" w/ 2.25\" inside","2.5\" w/ 2.25\" inside","2.5\" w/ 2.25\" inside","2.5\" w/ 2.25\" inside","Sign too big.  Use different post.","Sign too big.  Use different post.","Sign too big.  Use different post.","Sign too big.  Use different post."]
[7,6.5,3.25,45.5,"2.5\" w/ 2.25\" inside","2.5\" w/ 2.25\" inside","2.5\" w/ 2.25\" inside","2.5\" w/ 2.25\" inside","2.5\" w/ 2.25\" inside","2.5\" w/ 2.25\" inside","Sign too big.  Use different post.","Sign too big.  Use different post.","Sign too big.  Use different post.","Sign too big.  Use different post.","Sign too big.  Use different post."]
[7,7,3.5,49,"2.5\" w/ 2.25\" inside","2.5\" w/ 2.25\" inside","2.5\" w/ 2.25\" inside","2.5\" w/ 2.25\" inside","2.5\" w/ 2.25\" inside","Sign too big.  Use different post.","Sign too big.  Use different post.","Sign too big.  Use different post.","Sign too big.  Use different post.","Sign too big.  Use different post.","Sign too big.  Use different post."]
[7,7.5,3.75,52.5,"2.5\" w/ 2.25\" inside","2.5\" w/ 2.25\" inside","2.5\" w/ 2.25\" inside","Sign too big.  Use different post.","Sign too big.  Use different post.","Sign too big.  Use different post.","Sign too big.  Use different post.","Sign too big.  Use different post.","Sign too big.  Use different post.","Sign too big.  Use different post.","Sign too big.  Use different post."]
[7,8,4,56,"2.5\" w/ 2.25\" inside","2.5\" w/ 2.25\" inside","Sign too big.  Use different post.","Sign too big.  Use different post.","Sign too big.  Use different post.","Sign too big.  Use different post.","Sign too big.  Use different post.","Sign too big.  Use different post.","Sign too big.  Use different post.","Sign too big.  Use different post.","Sign too big.  Use different post."]
[]
[null,null,null,null,5]
["width","height","centroid","area",5,6,7,8,9,10,11,12,13,14,15]
[7.5,1,{"$f":"B400/2","v":0.5},{"$f":"A400*B400","v":7.5},"2\"","2\"","2\"","2\"","2\"","2\"","2\"","2\"","2\"","2\"","2\""]
[7.5,{"$f":"B400+0.5","v":1.5},{"$f":"B401/2","v":0.75},{"$f":"A401*B401","v":11.25},"2\"","2\"","2\"","2\"","2\"","2\"","2\"","2\"","2\"","2\"","2\""]
[7.5,{"$f":"B401+0.5","v":2},1,15,"2\"","2\"","2\"","2\"","2\"","2\"","2\"","2\"","2\"","2.5\"","2.5\""]
[7.5,2.5,1.25,18.75,"2\"","2\"","2\"","2\"","2\"","2\"","2.5\"","2.5\"","2.5\"","2.5\"","2.5\""]
[7.5,3,1.5,22.5,"2\"","2\"","2\"","2\"","2.5\"","2.5\"","2.5\"","2.5\"","2.5\"","2.5\" w/ 2.25\" inside","2.5\" w/ 2.25\" inside"]
[7.5,3.5,1.75,26.25,"2\"","2\"","2.5\"","2.5\"","2.5\"","2.5\"","2.5\"","2.5\" w/ 2.25\" inside","2.5\" w/ 2.25\" inside","2.5\" w/ 2.25\" inside","2.5\" w/ 2.25\" inside"]
[7.5,4,2,30,"2\"","2.5\"","2.5\"","2.5\"","2.5\"","2.5\" w/ 2.25\" inside","2.5\" w/ 2.25\" inside","2.5\" w/ 2.25\" inside","2.5\" w/ 2.25\" inside","2.5\" w/ 2.25\" inside","2.5\" w/ 2.25\" inside"]
[7.5,4.5,2.25,33.75,"2.5\"","2.5\"","2.5\"","2.5\" w/ 2.25\" inside","2.5\" w/ 2.25\" inside","2.5\" w/ 2.25\" inside","2.5\" w/ 2.25\" inside","2.5\" w/ 2.25\" inside","2.5\" w/ 2.25\" inside","2.5\" w/ 2.25\" inside","Sign too big.  Use different post."]
[7.5,5,2.5,37.5,"2.5\"","2.5\"","2.5\" w/ 2.25\" inside","2.5\" w/ 2.25\" inside","2.5\" w/ 2.25\" inside","2.5\" w/ 2.25\" inside","2.5\" w/ 2.25\" inside","2.5\" w/ 2.25\" inside","2.5\" w/ 2.25\" inside","2.5\" w/ 2.25\" inside","Sign too big.  Use different post."]
[7.5,5.5,2.75,41.25,"2.5\"","2.5\" w/ 2.25\" inside","2.5\" w/ 2.25\" inside","2.5\" w/ 2.25\" inside","2.5\" w/ 2.25\" inside","2.5\" w/ 2.25\" inside","2.5\" w/ 2.25\" inside","2.5\" w/ 2.25\" inside","Sign too big.  Use different post.","Sign too big.  Use different post.","Sign too big.  Use different post."]
[7.5,6,3,45,"2.5\" w/ 2.25\" inside","2.5\" w/ 2.25\" inside","2.5\" w/ 2.25\" inside","2.5\" w/ 2.25\" inside","2.5\" w/ 2.25\" inside","2.5\" w/ 2.25\" inside","Sign too big.  Use different post.","Sign too big.  Use different post.","Sign too big.  Use different post.","Sign too big.  Use different post.","Sign too big.  Use different post."]
[7.5,6.5,3.25,48.75,"2.5\" w/ 2.25\" inside","2.5\" w/ 2.25\" inside","2.5\" w/ 2.25\" inside","2.5\" w/ 2.25\" inside","2.5\" w/ 2.25\" inside","Sign too big.  Use different post.","Sign too big.  Use different post.","Sign too big.  Use different post.","Sign too big.  Use different post.","Sign too big.  Use different post.","Sign too big.  Use different post."]
[7.5,7,3.5,52.5,"2.5\" w/ 2.25\" inside","2.5\" w/ 2.25\" inside","2.5\" w/ 2.25\" inside","2.5\" w/ 2.25\" inside","Sign too big.  Use different post.","Sign too big.  Use different post.","Sign too big.  Use different post.","Sign too big.  Use different post.","Sign too big.  Use different post.","Sign too big.  Use different post.","Sign too big.  Use different post."]
[7.5,7.5,3.75,56.25,"2.5\" w/ 2.25\" inside","2.5\" w/ 2.25\" inside","2.5\" w/ 2.25\" inside","Sign too big.  Use different post.","Sign too big.  Use different post.","Sign too big.  Use different post.","Sign too big.  Use different post.","Sign too big.  Use different post.","Sign too big.  Use different post.","Sign too big.  Use different post.","Sign too big.  Use different post."]
[7.5,8,4,60,"2.5\" w/ 2.25\" inside","2.5\" w/ 2.25\" inside","Sign too big.  Use different post.","Sign too big.  Use different post.","Sign too big.  Use different post.","Sign too big.  Use different post.","Sign too big.  Use different post.","Sign too big.  Use different post.","Sign too big.  Use different post.","Sign too big.  Use different post.","Sign too big.  Use different post."]
[]
[null,null,null,null,5]
["width","height","centroid","area",5,6,7,8,9,10,11,12,13,14,15]
[8,1,{"$f":"B418/2","v":0.5},{"$f":"A418*B418","v":8},"2\"","2\"","2\"","2\"","2\"","2\"","2\"","2\"","2\"","2\"","2\""]
[8,{"$f":"B418+0.5","v":1.5},{"$f":"B419/2","v":0.75},{"$f":"A419*B419","v":12},"2\"","2\"","2\"","2\"","2\"","2\"","2\"","2\"","2\"","2\"","2\""]
[8,{"$f":"B419+0.5","v":2},1,16,"2\"","2\"","2\"","2\"","2\"","2\"","2\"","2\"","2.5\"","2.5\"","2.5\""]
[8,2.5,1.25,20,"2\"","2\"","2\"","2\"","2\"","2.5\"","2.5\"","2.5\"","2.5\"","2.5\"","2.5\""]
[8,3,1.5,24,"2\"","2\"","2\"","2.5\"","2.5\"","2.5\"","2.5\"","2.5\"","2.5\" w/ 2.25\" inside","2.5\" w/ 2.25\" inside","2.5\" w/ 2.25\" inside"]
[8,3.5,1.75,28,"2\"","2.5\"","2.5\"","2.5\"","2.5\"","2.5\"","2.5\" w/ 2.25\" inside","2.5\" w/ 2.25\" inside","2.5\" w/ 2.25\" inside","2.5\" w/ 2.25\" inside","2.5\" w/ 2.25\" inside"]
[8,4,2,32,"2.5\"","2.5\"","2.5\"","2.5\"","2.5\" w/ 2.25\" inside","2.5\" w/ 2.25\" inside","2.5\" w/ 2.25\" inside","2.5\" w/ 2.25\" inside","2.5\" w/ 2.25\" inside","2.5\" w/ 2.25\" inside","2.5\" w/ 2.25\" inside"]
[8,4.5,2.25,36,"2.5\"","2.5\"","2.5\"","2.5\" w/ 2.25\" inside","2.5\" w/ 2.25\" inside","2.5\" w/ 2.25\" inside","2.5\" w/ 2.25\" inside","2.5\" w/ 2.25\" inside","2.5\" w/ 2.25\" inside","2.5\" w/ 2.25\" inside","Sign too big.  Use different post."]
[8,5,2.5,40,"2.5\"","2.5\" w/ 2.25\" inside","2.5\" w/ 2.25\" inside","2.5\" w/ 2.25\" inside","2.5\" w/ 2.25\" inside","2.5\" w/ 2.25\" inside","2.5\" w/ 2.25\" inside","2.5\" w/ 2.25\" inside","Sign too big.  Use different post.","Sign too big.  Use different post.","Sign too big.  Use different post."]
[8,5.5,2.75,44,"2.5\" w/ 2.25\" inside","2.5\" w/ 2.25\" inside","2.5\" w/ 2.25\" inside","2.5\" w/ 2.25\" inside","2.5\" w/ 2.25\" inside","2.5\" w/ 2.25\" inside","2.5\" w/ 2.25\" inside","Sign too big.  Use different post.","Sign too big.  Use different post.","Sign too big.  Use different post.","Sign too big.  Use different post."]
[8,6,3,48,"2.5\" w/ 2.25\" inside","2.5\" w/ 2.25\" inside","2.5\" w/ 2.25\" inside","2.5\" w/ 2.25\" inside","2.5\" w/ 2.25\" inside","Sign too big.  Use different post.","Sign too big.  Use different post.","Sign too big.  Use different post.","Sign too big.  Use different post.","Sign too big.  Use different post.","Sign too big.  Use different post."]
[8,6.5,3.25,52,"2.5\" w/ 2.25\" inside","2.5\" w/ 2.25\" inside","2.5\" w/ 2.25\" inside","2.5\" w/ 2.25\" inside","Sign too big.  Use different post.","Sign too big.  Use different post.","Sign too big.  Use different post.","Sign too big.  Use different post.","Sign too big.  Use different post.","Sign too big.  Use different post.","Sign too big.  Use different post."]
[8,7,3.5,56,"2.5\" w/ 2.25\" inside","2.5\" w/ 2.25\" inside","2.5\" w/ 2.25\" inside","Sign too big.  Use different post.","Sign too big.  Use different post.","Sign too big.  Use different post.","Sign too big.  Use different post.","Sign too big.  Use different post.","Sign too big.  Use different post.","Sign too big.  Use different post.","Sign too big.  Use different post."]
[8,7.5,3.75,60,"2.5\" w/ 2.25\" inside","2.5\" w/ 2.25\" inside","Sign too big.  Use different post.","Sign too big.  Use different post.","Sign too big.  Use different post.","Sign too big.  Use different post.","Sign too big.  Use different post.","Sign too big.  Use different post.","Sign too big.  Use different post.","Sign too big.  Use different post.","Sign too big.  Use different post."]
[8,8,4,64,"2.5\" w/ 2.25\" inside","Sign too big.  Use different post.","Sign too big.  Use different post.","Sign too big.  Use different post.","Sign too big.  Use different post.","Sign too big.  Use different post.","Sign too big.  Use different post.","Sign too big.  Use different post.","Sign too big.  Use different post.","Sign too big.  Use different post.","Sign too big.  Use different post."]
[]
["DOUBLE POST - 7' MOUNTING HEIGHT"]
[]
[null,null,null,null,7]
["width","height","centroid","area",7,8,9,10,11,12,13,14,15]
[4,1,{"$f":"B438/2","v":0.5},{"$f":"A438*B438","v":4},"2\"","2\"","2\"","2\"","2\"","2\"","2\"","2\"","2\""]
[4,{"$f":"B438+0.5","v":1.5},{"$f":"B439/2","v":0.75},{"$f":"A439*B439","v":6},"2\"","2\"","2\"","2\"","2\"","2\"","2\"","2\"","2\""]
[4,{"$f":"B439+0.5","v":2},1,8,"2\"","2\"","2\"","2\"","2\"","2\"","2\"","2\"","2\""]
[4,2.5,1.25,10,"2\"","2\"","2\"","2\"","2\"","2\"","2\"","2\"","2\""]
[4,3,1.5,12,"2\"","2\"","2\"","2\"","2\"","2\"","2\"","2\"","2\""]
[4,3.5,1.75,14,"2\"","2\"","2\"","2\"","2\"","2\"","2\"","2.5\"","Sign too big.  Use different post."]
[4,4,2,16,"2\"","2\"","2\"","2\"","2\"","2.5\"","2.5\"","2.5\"","Sign too big.  Use different post."]
[4,4.5,2.25,18,"2\"","2\"","2\"","2.5\"","2.5\"","2.5\"","2.5\"","2.5\"","Sign too big.  Use different post."]
[4,5,2.5,20,"2\"","2\"","2.5\"","2.5\"","2.5\"","2.5\"","2.5\"","2.5\"","Sign too big.  Use different post."]
[4,{"$f":"B446+0.5","v":5.5},2.75,22,"2.5\"","2.5\"","2.5\"","2.5\"","2.5\"","2.5\"","2.5\" w/ 2.25\" inside","Sign too big.  Use different post.","Sign too big.  Use different post."]
[4,6,3,24,"2.5\"","2.5\"","2.5\"","2.5\"","2.5\"","2.5\" w/ 2.25\" inside","2.5\" w/ 2.25\" inside","Sign too big.  Use different post.","Sign too big.  Use different post."]
[4,6.5,3.25,26,"2.5\"","2.5\"","2.5\"","2.5\" w/ 2.25\" inside","2.5\" w/ 2.25\" inside","2.5\" w/ 2.25\" inside","2.5\" w/ 2.25\" inside","Sign too big.  Use different post.","Sign too big.  Use different post."]
[4,7,3.5,28,"2.5\"","2.5\"","2.5\" w/ 2.25\" inside","2.5\" w/ 2.25\" inside","2.5\" w/ 2.25\" inside","2.5\" w/ 2.25\" inside","2.5\" w/ 2.25\" inside","Sign too big.  Use different post.","Sign too big.  Use different post."]
[4,{"$f":"B450+0.5","v":7.5},3.75,30,"2.5\"","2.5\" w/ 2.25\" inside","2.5\" w/ 2.25\" inside","2.5\" w/ 2.25\" inside","2.5\" w/ 2.25\" inside","2.5\" w/ 2.25\" inside","Sign too big.  Use different post.","Sign too big.  Use different post.","Sign too big.  Use different post."]
[4,8,4,32,"2.5\" w/ 2.25\" inside","2.5\" w/ 2.25\" inside","2.5\" w/ 2.25\" inside","2.5\" w/ 2.25\" inside","2.5\" w/ 2.25\" inside","2.5\" w/ 2.25\" inside","Sign too big.  Use different post.","Sign too big.  Use different post.","Sign too big.  Use different post."]
[]
[null,null,null,null,7]
["width","height","centroid","area",7,8,9,10,11,12,13,14,15]
[4.5,1,{"$f":"B456/2","v":0.5},{"$f":"A456*B456","v":4.5},"2\"","2\"","2\"","2\"","2\"","2\"","2\"","2\"","2\""]
[4.5,{"$f":"B456+0.5","v":1.5},{"$f":"B457/2","v":0.75},{"$f":"A457*B457","v":6.75},"2\"","2\"","2\"","2\"","2\"","2\"","2\"","2\"","2\""]
[4.5,{"$f":"B457+0.5","v":2},1,9,"2\"","2\"","2\"","2\"","2\"","2\"","2\"","2\"","2\""]
[4.5,2.5,1.25,11.25,"2\"","2\"","2\"","2\"","2\"","2\"","2\"","2\"","2\""]
[4.5,3,1.5,13.5,"2\"","2\"","2\"","2\"","2\"","2\"","2\"","2\"","2.5\""]
[4.5,3.5,1.75,15.75,"2\"","2\"","2\"","2\"","2\"","2.5\"","2.5\"","2.5\"","Sign too big.  Use different post."]
[4.5,4,2,18,"2\"","2\"","2\"","2.5\"","2.5\"","2.5\"","2.5\"","2.5\"","Sign too big.  Use different post."]
[4.5,4.5,2.25,20.25,"2\"","2\"","2.5\"","2.5\"","2.5\"","2.5\"","2.5\"","2.5\"","Sign too big.  Use different post."]
[4.5,5,2.5,22.5,"2\"","2.5\"","2.5\"","2.5\"","2.5\"","2.5\"","2.5\" w/ 2.25\" inside","2.5\" w/ 2.25\" inside","Sign too big.  Use different post."]
[4.5,5.5,2.75,24.75,"2.5\"","2.5\"","2.5\"","2.5\"","2.5\" w/ 2.25\" inside","2.5\" w/ 2.25\" inside","2.5\" w/ 2.25\" inside","Sign too big.  Use different post.","Sign too big.  Use different post."]
[4.5,6,3,27,"2.5\"","2.5\"","2.5\"","2.5\" w/ 2.25\" inside","2.5\" w/ 2.25\" inside","2.5\" w/ 2.25\" inside","2.5\" w/ 2.25\" inside","Sign too big.  Use different post.","Sign too big.  Use different post."]
[4.5,6.5,3.25,29.25,"2.5\"","2.5\"","2.5\" w/ 2.25\" inside","2.5\" w/ 2.25\" inside","2.5\" w/ 2.25\" inside","2.5\" w/ 2.25\" inside","2.5\" w/ 2.25\" inside","Sign too big.  Use different post.","Sign too big.  Use different post."]
[4.5,7,3.5,31.5,"2.5\"","2.5\" w/ 2.25\" inside","2.5\" w/ 2.25\" inside","2.5\" w/ 2.25\" inside","2.5\" w/ 2.25\" inside","2.5\" w/ 2.25\" inside","2.5\" w/ 2.25\" inside","Sign too big.  Use different post.","Sign too big.  Use different post."]
[4.5,7.5,3.75,33.75,"2.5\" w/ 2.25\" inside","2.5\" w/ 2.25\" inside","2.5\" w/ 2.25\" inside","2.5\" w/ 2.25\" inside","2.5\" w/ 2.25\" inside","2.5\" w/ 2.25\" inside","Sign too big.  Use different post.","Sign too big.  Use different post.","Sign too big.  Use different post."]
[4.5,8,4,36,"2.5\" w/ 2.25\" inside","2.5\" w/ 2.25\" inside","2.5\" w/ 2.25\" inside","2.5\" w/ 2.25\" inside","2.5\" w/ 2.25\" inside","2.5\" w/ 2.25\" inside","Sign too big.  Use different post.","Sign too big.  Use different post.","Sign too big.  Use different post."]
[]
[null,null,null,null,7]
["width","height","centroid","area",7,8,9,10,11,12,13,14,15]
[5,1,{"$f":"B474/2","v":0.5},{"$f":"A474*B474","v":5},"2\"","2\"","2\"","2\"","2\"","2\"","2\"","2\"","2\""]
[5,{"$f":"B474+0.5","v":1.5},{"$f":"B475/2","v":0.75},{"$f":"A475*B475","v":7.5},"2\"","2\"","2\"","2\"","2\"","2\"","2\"","2\"","2\""]
[5,{"$f":"B475+0.5","v":2},1,10,"2\"","2\"","2\"","2\"","2\"","2\"","2\"","2\"","2\""]
[5,2.5,1.25,12.5,"2\"","2\"","2\"","2\"","2\"","2\"","2\"","2\"","2\""]
[5,3,1.5,15,"2\"","2\"","2\"","2\"","2\"","2\"","2.5\"","2.5\"","2.5\""]
[5,3.5,1.75,17.5,"2\"","2\"","2\"","2\"","2.5\"","2.5\"","2.5\"","2.5\"","Sign too big.  Use different post."]
[5,4,2,20,"2\"","2\"","2.5\"","2.5\"","2.5\"","2.5\"","2.5\"","2.5\"","Sign too big.  Use different post."]
[5,4.5,2.25,22.5,"2\"","2.5\"","2.5\"","2.5\"","2.5\"","2.5\"","2.5\" w/ 2.25\" inside","2.5\" w/ 2.25\" inside","Sign too big.  Use different post."]
[5,5,2.5,25,"2.5\"","2.5\"","2.5\"","2.5\"","2.5\"","2.5\" w/ 2.25\" inside","2.5\" w/ 2.25\" inside","2.5\" w/ 2.25\" inside","Sign too big.  Use different post."]
[5,5.5,2.75,27.5,"2.5\"","2.5\"","2.5\"","2.5\" w/ 2.25\" inside","2.5\" w/ 2.25\" inside","2.5\" w/ 2.25\" inside","2.5\" w/ 2.25\" inside","Sign too big.  Use different post.","Sign too big.  Use different post."]
[5,6,3,30,"2.5\"","2.5\"","2.5\" w/ 2.25\" inside","2.5\" w/ 2.25\" inside","2.5\" w/ 2.25\" inside","2.5\" w/ 2.25\" inside","2.5\" w/ 2.25\" inside","Sign too big.  Use different post.","Sign too big.  Use different post."]
[5,6.5,3.25,32.5,"2.5\"","2.5\" w/ 2.25\" inside","2.5\" w/ 2.25\" inside","2.5\" w/ 2.25\" inside","2.5\" w/ 2.25\" inside","2.5\" w/ 2.25\" inside","2.5\" w/ 2.25\" inside","Sign too big.  Use different post.","Sign too big.  Use different post."]
[5,7,3.5,35,"2.5\" w/ 2.25\" inside","2.5\" w/ 2.25\" inside","2.5\" w/ 2.25\" inside","2.5\" w/ 2.25\" inside","2.5\" w/ 2.25\" inside","2.5\" w/ 2.25\" inside","2.5\" w/ 2.25\" inside","Sign too big.  Use different post.","Sign too big.  Use different post."]
[5,7.5,3.75,37.5,"2.5\" w/ 2.25\" inside","2.5\" w/ 2.25\" inside","2.5\" w/ 2.25\" inside","2.5\" w/ 2.25\" inside","2.5\" w/ 2.25\" inside","2.5\" w/ 2.25\" inside","Sign too big.  Use different post.","Sign too big.  Use different post.","Sign too big.  Use different post."]
[5,8,4,40,"2.5\" w/ 2.25\" inside","2.5\" w/ 2.25\" inside","2.5\" w/ 2.25\" inside","2.5\" w/ 2.25\" inside","2.5\" w/ 2.25\" inside","Sign too big.  Use different post.","Sign too big.  Use different post.","Sign too big.  Use different post.","Sign too big.  Use different post."]
[]
[null,null,null,null,7]
["width","height","centroid","area",7,8,9,10,11,12,13,14,15]
[5.5,1,{"$f":"B492/2","v":0.5},{"$f":"A492*B492","v":5.5},"2\"","2\"","2\"","2\"","2\"","2\"","2\"","2\"","2\""]
[5.5,{"$f":"B492+0.5","v":1.5},{"$f":"B493/2","v":0.75},{"$f":"A493*B493","v":8.25},"2\"","2\"","2\"","2\"","2\"","2\"","2\"","2\"","2\""]
[5.5,{"$f":"B493+0.5","v":2},1,11,"2\"","2\"","2\"","2\"","2\"","2\"","2\"","2\"","2\""]
[5.5,2.5,1.25,13.75,"2\"","2\"","2\"","2\"","2\"","2\"","2\"","2\"","2.5\""]
[5.5,3,1.5,16.5,"2\"","2\"","2\"","2\"","2\"","2.5\"","2.5\"","2.5\"","2.5\""]
[5.5,3.5,1.75,19.25,"2\"","2\"","2\"","2.5\"","2.5\"","2.5\"","2.5\"","2.5\"","Sign too big.  Use different post."]
[5.5,4,2,22,"2\"","2.5\"","2.5\"","2.5\"","2.5\"","2.5\"","2.5\"","2.5\" w/ 2.25\" inside","Sign too big.  Use different post."]
[5.5,4.5,2.25,24.75,"2.5\"","2.5\"","2.5\"","2.5\"","2.5\"","2.5\" w/ 2.25\" inside","2.5\" w/ 2.25\" inside","2.5\" w/ 2.25\" inside","Sign too big.  Use different post."]
[5.5,5,2.5,27.5,"2.5\"","2.5\"","2.5\"","2.5\"","2.5\" w/ 2.25\" inside","2.5\" w/ 2.25\" inside","2.5\" w/ 2.25\" inside","2.5\" w/ 2.25\" inside","Sign too big.  Use different post."]
[5.5,5.5,2.75,30.25,"2.5\"","2.5\"","2.5\" w/ 2.25\" inside","2.5\" w/ 2.25\" inside","2.5\" w/ 2.25\" inside","2.5\" w/ 2.25\" inside","2.5\" w/ 2.25\" inside","Sign too big.  Use different post.","Sign too big.  Use different post."]
[5.5,6,3,33,"2.5\"","2.5\" w/ 2.25\" inside","2.5\" w/ 2.25\" inside","2.5\" w/ 2.25\" inside","2.5\" w/ 2.25\" inside","2.5\" w/ 2.25\" inside","2.5\" w/ 2.25\" inside","Sign too big.  Use different post.","Sign too big.  Use different post."]
[5.5,6.5,3.25,35.75,"2.5\" w/ 2.25\" inside","2.5\" w/ 2.25\" inside","2.5\" w/ 2.25\" inside","2.5\" w/ 2.25\" inside","2.5\" w/ 2.25\" inside","2.5\" w/ 2.25\" inside","2.5\" w/ 2.25\" inside","Sign too big.  Use different post.","Sign too big.  Use different post."]
[5.5,7,3.5,38.5,"2.5\" w/ 2.25\" inside","2.5\" w/ 2.25\" inside","2.5\" w/ 2.25\" inside","2.5\" w/ 2.25\" inside","2.5\" w/ 2.25\" inside","2.5\" w/ 2.25\" inside","Sign too big.  Use different post.","Sign too big.  Use different post.","Sign too big.  Use different post."]
[5.5,7.5,3.75,41.25,"2.5\" w/ 2.25\" inside","2.5\" w/ 2.25\" inside","2.5\" w/ 2.25\" inside","2.5\" w/ 2.25\" inside","2.5\" w/ 2.25\" inside","Sign too big.  Use different post.","Sign too big.  Use different post.","Sign too big.  Use different post.","Sign too big.  Use different post."]
[5.5,8,4,44,"2.5\" w/ 2.25\" inside","2.5\" w/ 2.25\" inside","2.5\" w/ 2.25\" inside","2.5\" w/ 2.25\" inside","Sign too big.  Use different post.","Sign too big.  Use different post.","Sign too big.  Use different post.","Sign too big.  Use different post.","Sign too big.  Use different post."]
[]
[null,null,null,null,7]
["width","height","centroid","area",7,8,9,10,11,12,13,14,15]
[6,1,{"$f":"B510/2","v":0.5},{"$f":"A510*B510","v":6},"2\"","2\"","2\"","2\"","2\"","2\"","2\"","2\"","2\""]
[6,{"$f":"B510+0.5","v":1.5},{"$f":"B511/2","v":0.75},{"$f":"A511*B511","v":9},"2\"","2\"","2\"","2\"","2\"","2\"","2\"","2\"","2\""]
[6,{"$f":"B511+0.5","v":2},1,12,"2\"","2\"","2\"","2\"","2\"","2\"","2\"","2\"","2\""]
[6,2.5,1.25,15,"2\"","2\"","2\"","2\"","2\"","2\"","2.5\"","2.5\"","2.5\""]
[6,3,1.5,18,"2\"","2\"","2\"","2\"","2.5\"","2.5\"","2.5\"","2.5\"","2.5\""]
[6,3.5,1.75,21,"2\"","2\"","2.5\"","2.5\"","2.5\"","2.5\"","2.5\"","2.5\"","Sign too big.  Use different post."]
[6,4,2,24,"2.5\"","2.5\"","2.5\"","2.5\"","2.5\"","2.5\"","2.5\" w/ 2.25\" inside","2.5\" w/ 2.25\" inside","Sign too big.  Use different post."]
[6,4.5,2.25,27,"2.5\"","2.5\"","2.5\"","2.5\"","2.5\" w/ 2.25\" inside","2.5\" w/ 2.25\" inside","2.5\" w/ 2.25\" inside","2.5\" w/ 2.25\" inside","Sign too big.  Use different post."]
[6,5,2.5,30,"2.5\"","2.5\"","2.5\" w/ 2.25\" inside","2.5\" w/ 2.25\" inside","2.5\" w/ 2.25\" inside","2.5\" w/ 2.25\" inside","2.5\" w/ 2.25\" inside","2.5\" w/ 2.25\" inside","Sign too big.  Use different post."]
[6,5.5,2.75,33,"2.5\"","2.5\" w/ 2.25\" inside","2.5\" w/ 2.25\" inside","2.5\" w/ 2.25\" inside","2.5\" w/ 2.25\" inside","2.5\" w/ 2.25\" inside","2.5\" w/ 2.25\" inside","Sign too big.  Use different post.","Sign too big.  Use different post."]
[6,6,3,36,"2.5\" w/ 2.25\" inside","2.5\" w/ 2.25\" inside","2.5\" w/ 2.25\" inside","2.5\" w/ 2.25\" inside","2.5\" w/ 2.25\" inside","2.5\" w/ 2.25\" inside","2.5\" w/ 2.25\" inside","Sign too big.  Use different post.","Sign too big.  Use different post."]
[6,6.5,3.25,39,"2.5\" w/ 2.25\" inside","2.5\" w/ 2.25\" inside","2.5\" w/ 2.25\" inside","2.5\" w/ 2.25\" inside","2.5\" w/ 2.25\" inside","2.5\" w/ 2.25\" inside","Sign too big.  Use different post.","Sign too big.  Use different post.","Sign too big.  Use different post."]
[6,7,3.5,42,"2.5\" w/ 2.25\" inside","2.5\" w/ 2.25\" inside","2.5\" w/ 2.25\" inside","2.5\" w/ 2.25\" inside","2.5\" w/ 2.25\" inside","Sign too big.  Use different post.","Sign too big.  Use different post.","Sign too big.  Use different post.","Sign too big.  Use different post."]
[6,7.5,3.75,45,"2.5\" w/ 2.25\" inside","2.5\" w/ 2.25\" inside","2.5\" w/ 2.25\" inside","Sign too big.  Use different post.","Sign too big.  Use different post.","Sign too big.  Use different post.","Sign too big.  Use different post.","Sign too big.  Use different post.","Sign too big.  Use different post."]
[6,8,4,48,"2.5\" w/ 2.25\" inside","2.5\" w/ 2.25\" inside","Sign too big.  Use different post.","Sign too big.  Use different post.","Sign too big.  Use different post.","Sign too big.  Use different post.","Sign too big.  Use different post.","Sign too big.  Use different post.","Sign too big.  Use different post."]
[]
[null,null,null,null,7]
["width","height","centroid","area",7,8,9,10,11,12,13,14,15]
[6.5,1,{"$f":"B528/2","v":0.5},{"$f":"A528*B528","v":6.5},"2\"","2\"","2\"","2\"","2\"","2\"","2\"","2\"","2\""]
[6.5,{"$f":"B528+0.5","v":1.5},{"$f":"B529/2","v":0.75},{"$f":"A529*B529","v":9.75},"2\"","2\"","2\"","2\"","2\"","2\"","2\"","2\"","2\""]
[6.5,{"$f":"B529+0.5","v":2},1,13,"2\"","2\"","2\"","2\"","2\"","2\"","2\"","2\"","2\""]
[6.5,2.5,1.25,16.25,"2\"","2\"","2\"","2\"","2\"","2.5\"","2.5\"","2.5\"","2.5\""]
[6.5,3,1.5,19.5,"2\"","2\"","2\"","2.5\"","2.5\"","2.5\"","2.5\"","2.5\"","2.5\""]
[6.5,3.5,1.75,22.75,"2\"","2.5\"","2.5\"","2.5\"","2.5\"","2.5\"","2.5\"","2.5\" w/ 2.25\" inside","Sign too big.  Use different post."]
[6.5,4,2,26,"2.5\"","2.5\"","2.5\"","2.5\"","2.5\"","2.5\" w/ 2.25\" inside","2.5\" w/ 2.25\" inside","2.5\" w/ 2.25\" inside","Sign too big.  Use different post."]
[6.5,4.5,2.25,29.25,"2.5\"","2.5\"","2.5\"","2.5\" w/ 2.25\" inside","2.5\" w/ 2.25\" inside","2.5\" w/ 2.25\" inside","2.5\" w/ 2.25\" inside","2.5\" w/ 2.25\" inside","Sign too big.  Use different post."]
[6.5,5,2.5,32.5,"2.5\"","2.5\"","2.5\" w/ 2.25\" inside","2.5\" w/ 2.25\" inside","2.5\" w/ 2.25\" inside","2.5\" w/ 2.25\" inside","2.5\" w/ 2.25\" inside","2.5\" w/ 2.25\" inside","Sign too big.  Use different post."]
[6.5,5.5,2.75,35.75,"2.5\" w/ 2.25\" inside","2.5\" w/ 2.25\" inside","2.5\" w/ 2.25\" inside","2.5\" w/ 2.25\" inside","2.5\" w/ 2.25\" inside","2.5\" w/ 2.25\" inside","2.5\" w/ 2.25\" inside","Sign too big.  Use different post.","Sign too big.  Use different post."]
[6.5,6,3,39,"2.5\" w/ 2.25\" inside","2.5\" w/ 2.25\" inside","2.5\" w/ 2.25\" inside","2.5\" w/ 2.25\" inside","2.5\" w/ 2.25\" inside","2.5\" w/ 2.25\" inside","Sign too big.  Use different post.","Sign too big.  Use different post.","Sign too big.  Use different post."]
[6.5,6.5,3.25,42.25,"2.5\" w/ 2.25\" inside","2.5\" w/ 2.25\" inside","2.5\" w/ 2.25\" inside","2.5\" w/ 2.25\" inside","2.5\" w/ 2.25\" inside","Sign too big.  Use different post.","Sign too big.  Use different post.","Sign too big.  Use different post.","Sign too big.  Use different post."]
[6.5,7,3.5,45.5,"2.5\" w/ 2.25\" inside","2.5\" w/ 2.25\" inside","2.5\" w/ 2.25\" inside","2.5\" w/ 2.25\" inside","Sign too big.  Use different post.","Sign too big.  Use different post.","Sign too big.  Use different post.","Sign too big.  Use different post.","Sign too big.  Use different post."]
[6.5,7.5,3.75,48.75,"2.5\" w/ 2.25\" inside","2.5\" w/ 2.25\" inside","Sign too big.  Use different post.","Sign too big.  Use different post.","Sign too big.  Use different post.","Sign too big.  Use different post.","Sign too big.  Use different post.","Sign too big.  Use different post.","Sign too big.  Use different post."]
[6.5,8,4,52,"2.5\" w/ 2.25\" inside","Sign too big.  Use different post.","Sign too big.  Use different post.","Sign too big.  Use different post.","Sign too big.  Use different post.","Sign too big.  Use different post.","Sign too big.  Use different post.","Sign too big.  Use different post.","Sign too big.  Use different post."]
[]
[null,null,null,null,7]
["width","height","centroid","area",7,8,9,10,11,12,13,14,15]
[7,1,{"$f":"B546/2","v":0.5},{"$f":"A546*B546","v":7},"2\"","2\"","2\"","2\"","2\"","2\"","2\"","2\"","2\""]
[7,{"$f":"B546+0.5","v":1.5},{"$f":"B547/2","v":0.75},{"$f":"A547*B547","v":10.5},"2\"","2\"","2\"","2\"","2\"","2\"","2\"","2\"","2\""]
[7,{"$f":"B547+0.5","v":2},1,14,"2\"","2\"","2\"","2\"","2\"","2\"","2\"","2\"","2.5\""]
[7,2.5,1.25,17.5,"2\"","2\"","2\"","2\"","2.5\"","2.5\"","2.5\"","2.5\"","2.5\""]
[7,3,1.5,21,"2\"","2\"","2.5\"","2.5\"","2.5\"","2.5\"","2.5\"","2.5\"","2.5\" w/ 2.25\" inside"]
[7,3.5,1.75,24.5,"2.5\"","2.5\"","2.5\"","2.5\"","2.5\"","2.5\"","2.5\" w/ 2.25\" inside","2.5\" w/ 2.25\" inside","Sign too big.  Use different post."]
[7,4,2,28,"2.5\"","2.5\"","2.5\"","2.5\"","2.5\" w/ 2.25\" inside","2.5\" w/ 2.25\" inside","2.5\" w/ 2.25\" inside","2.5\" w/ 2.25\" inside","Sign too big.  Use different post."]
[7,4.5,2.25,31.5,"2.5\"","2.5\"","2.5\" w/ 2.25\" inside","2.5\" w/ 2.25\" inside","2.5\" w/ 2.25\" inside","2.5\" w/ 2.25\" inside","2.5\" w/ 2.25\" inside","2.5\" w/ 2.25\" inside","Sign too big.  Use different post."]
[7,5,2.5,35,"2.5\"","2.5\" w/ 2.25\" inside","2.5\" w/ 2.25\" inside","2.5\" w/ 2.25\" inside","2.5\" w/ 2.25\" inside","2.5\" w/ 2.25\" inside","2.5\" w/ 2.25\" inside","2.5\" w/ 2.25\" inside","Sign too big.  Use different post."]
[7,5.5,2.75,38.5,"2.5\" w/ 2.25\" inside","2.5\" w/ 2.25\" inside","2.5\" w/ 2.25\" inside","2.5\" w/ 2.25\" inside","2.5\" w/ 2.25\" inside","2.5\" w/ 2.25\" inside","2.5\" w/ 2.25\" inside","Sign too big.  Use different post.","Sign too big.  Use different post."]
[7,6,3,42,"2.5\" w/ 2.25\" inside","2.5\" w/ 2.25\" inside","2.5\" w/ 2.25\" inside","2.5\" w/ 2.25\" inside","2.5\" w/ 2.25\" inside","Sign too big.  Use different post.","Sign too big.  Use different post.","Sign too big.  Use different post.","Sign too big.  Use different post."]
[7,6.5,3.25,45.5,"2.5\" w/ 2.25\" inside","2.5\" w/ 2.25\" inside","2.5\" w/ 2.25\" inside","2.5\" w/ 2.25\" inside","Sign too big.  Use different post.","Sign too big.  Use different post.","Sign too big.  Use different post.","Sign too big.  Use different post.","Sign too big.  Use different post."]
[7,7,3.5,49,"2.5\" w/ 2.25\" inside","2.5\" w/ 2.25\" inside","2.5\" w/ 2.25\" inside","Sign too big.  Use different post.","Sign too big.  Use different post.","Sign too big.  Use different post.","Sign too big.  Use different post.","Sign too big.  Use different post.","Sign too big.  Use different post."]
[7,7.5,3.75,52.5,"2.5\" w/ 2.25\" inside","Sign too big.  Use different post.","Sign too big.  Use different post.","Sign too big.  Use different post.","Sign too big.  Use different post.","Sign too big.  Use different post.","Sign too big.  Use different post.","Sign too big.  Use different post.","Sign too big.  Use different post."]
[7,8,4,56,"2.5\" w/ 2.25\" inside","Sign too big.  Use different post.","Sign too big.  Use different post.","Sign too big.  Use different post.","Sign too big.  Use different post.","Sign too big.  Use different post.","Sign too big.  Use different post.","Sign too big.  Use different post.","Sign too big.  Use different post."]
[]
[null,null,null,null,7]
["width","height","centroid","area",7,8,9,10,11,12,13,14,15]
[7.5,1,{"$f":"B564/2","v":0.5},{"$f":"A564*B564","v":7.5},"2\"","2\"","2\"","2\"","2\"","2\"","2\"","2\"","2\""]
[7.5,{"$f":"B564+0.5","v":1.5},{"$f":"B565/2","v":0.75},{"$f":"A565*B565","v":11.25},"2\"","2\"","2\"","2\"","2\"","2\"","2\"","2\"","2\""]
[7.5,{"$f":"B565+0.5","v":2},1,15,"2\"","2\"","2\"","2\"","2\"","2\"","2\"","2.5\"","2.5\""]
[7.5,2.5,1.25,18.75,"2\"","2\"","2\"","2.5\"","2.5\"","2.5\"","2.5\"","2.5\"","2.5\""]
[7.5,3,1.5,22.5,"2\"","2\"","2.5\"","2.5\"","2.5\"","2.5\"","2.5\"","2.5\" w/ 2.25\" inside","2.5\" w/ 2.25\" inside"]
[7.5,3.5,1.75,26.25,"2.5\"","2.5\"","2.5\"","2.5\"","2.5\"","2.5\" w/ 2.25\" inside","2.5\" w/ 2.25\" inside","2.5\" w/ 2.25\" inside","Sign too big.  Use different post."]
[7.5,4,2,30,"2.5\"","2.5\"","2.5\"","2.5\" w/ 2.25\" inside","2.5\" w/ 2.25\" inside","2.5\" w/ 2.25\" inside","2.5\" w/ 2.25\" inside","2.5\" w/ 2.25\" inside","Sign too big.  Use different post."]
[7.5,4.5,2.25,33.75,"2.5\"","2.5\" w/ 2.25\" inside","2.5\" w/ 2.25\" inside","2.5\" w/ 2.25\" inside","2.5\" w/ 2.25\" inside","2.5\" w/ 2.25\" inside","2.5\" w/ 2.25\" inside","2.5\" w/ 2.25\" inside","Sign too big.  Use different post."]
[7.5,5,2.5,37.5,"2.5\" w/ 2.25\" inside","2.5\" w/ 2.25\" inside","2.5\" w/ 2.25\" inside","2.5\" w/ 2.25\" inside","2.5\" w/ 2.25\" inside","2.5\" w/ 2.25\" inside","2.5\" w/ 2.25\" inside","2.5\" w/ 2.25\" inside","Sign too big.  Use different post."]
[7.5,5.5,2.75,41.25,"2.5\" w/ 2.25\" inside","2.5\" w/ 2.25\" inside","2.5\" w/ 2.25\" inside","2.5\" w/ 2.25\" inside","2.5\" w/ 2.25\" inside","2.5\" w/ 2.25\" inside","Sign too big.  Use different post.","Sign too big.  Use different post.","Sign too big.  Use different post."]
[7.5,6,3,45,"2.5\" w/ 2.25\" inside","2.5\" w/ 2.25\" inside","2.5\" w/ 2.25\" inside","2.5\" w/ 2.25\" inside","Sign too big.  Use different post.","Sign too big.  Use different post.","Sign too big.  Use different post.","Sign too big.  Use different post.","Sign too big.  Use different post."]
[7.5,6.5,3.25,48.75,"2.5\" w/ 2.25\" inside","2.5\" w/ 2.25\" inside","2.5\" w/ 2.25\" inside","Sign too big.  Use different post.","Sign too big.  Use different post.","Sign too big.  Use different post.","Sign too big.  Use different post.","Sign too big.  Use different post.","Sign too big.  Use different post."]
[7.5,7,3.5,52.5,"2.5\" w/ 2.25\" inside","2.5\" w/ 2.25\" inside","Sign too big.  Use different post.","Sign too big.  Use different post.","Sign too big.  Use different post.","Sign too big.  Use different post.","Sign too big.  Use different post.","Sign too big.  Use different post.","Sign too big.  Use different post."]
[7.5,7.5,3.75,56.25,"2.5\" w/ 2.25\" inside","Sign too big.  Use different post.","Sign too big.  Use different post.","Sign too big.  Use different post.","Sign too big.  Use different post.","Sign too big.  Use different post.","Sign too big.  Use different post.","Sign too big.  Use different post.","Sign too big.  Use different post."]
[7.5,8,4,60,"Sign too big.  Use different post.","Sign too big.  Use different post.","Sign too big.  Use different post.","Sign too big.  Use different post.","Sign too big.  Use different post.","Sign too big.  Use different post.","Sign too big.  Use different post.","Sign too big.  Use different post.","Sign too big.  Use different post."]
[]
[null,null,null,null,7]
["width","height","centroid","area",7,8,9,10,11,12,13,14,15]
[8,1,{"$f":"B582/2","v":0.5},{"$f":"A582*B582","v":8},"2\"","2\"","2\"","2\"","2\"","2\"","2\"","2\"","2\""]
[8,{"$f":"B582+0.5","v":1.5},{"$f":"B583/2","v":0.75},{"$f":"A583*B583","v":12},"2\"","2\"","2\"","2\"","2\"","2\"","2\"","2\"","2\""]
[8,{"$f":"B583+0.5","v":2},1,16,"2\"","2\"","2\"","2\"","2\"","2\"","2.5\"","2.5\"","2.5\""]
[8,2.5,1.25,20,"2\"","2\"","2\"","2.5\"","2.5\"","2.5\"","2.5\"","2.5\"","2.5\""]
[8,3,1.5,24,"2\"","2.5\"","2.5\"","2.5\"","2.5\"","2.5\"","2.5\" w/ 2.25\" inside","2.5\" w/ 2.25\" inside","2.5\" w/ 2.25\" inside"]
[8,3.5,1.75,28,"2.5\"","2.5\"","2.5\"","2.5\"","2.5\" w/ 2.25\" inside","2.5\" w/ 2.25\" inside","2.5\" w/ 2.25\" inside","2.5\" w/ 2.25\" inside","Sign too big.  Use different post."]
[8,4,2,32,"2.5\"","2.5\"","2.5\" w/ 2.25\" inside","2.5\" w/ 2.25\" inside","2.5\" w/ 2.25\" inside","2.5\" w/ 2.25\" inside","2.5\" w/ 2.25\" inside","2.5\" w/ 2.25\" inside","Sign too big.  Use different post."]
[8,4.5,2.25,36,"2.5\"","2.5\" w/ 2.25\" inside","2.5\" w/ 2.25\" inside","2.5\" w/ 2.25\" inside","2.5\" w/ 2.25\" inside","2.5\" w/ 2.25\" inside","2.5\" w/ 2.25\" inside","2.5\" w/ 2.25\" inside","Sign too big.  Use different post."]
[8,5,2.5,40,"2.5\" w/ 2.25\" inside","2.5\" w/ 2.25\" inside","2.5\" w/ 2.25\" inside","2.5\" w/ 2.25\" inside","2.5\" w/ 2.25\" inside","2.5\" w/ 2.25\" inside","Sign too big.  Use different post.","Sign too big.  Use different post.","Sign too big.  Use different post."]
[8,5.5,2.75,44,"2.5\" w/ 2.25\" inside","2.5\" w/ 2.25\" inside","2.5\" w/ 2.25\" inside","2.5\" w/ 2.25\" inside","2.5\" w/ 2.25\" inside","Sign too big.  Use different post.","Sign too big.  Use different post.","Sign too big.  Use different post.","Sign too big.  Use different post."]
[8,6,3,48,"2.5\" w/ 2.25\" inside","2.5\" w/ 2.25\" inside","2.5\" w/ 2.25\" inside","Sign too big.  Use different post.","Sign too big.  Use different post.","Sign too big.  Use different post.","Sign too big.  Use different post.","Sign too big.  Use different post.","Sign too big.  Use different post."]
[8,6.5,3.25,52,"2.5\" w/ 2.25\" inside","2.5\" w/ 2.25\" inside","Sign too big.  Use different post.","Sign too big.  Use different post.","Sign too big.  Use different post.","Sign too big.  Use different post.","Sign too big.  Use different post.","Sign too big.  Use different post.","Sign too big.  Use different post."]
[8,7,3.5,56,"2.5\" w/ 2.25\" inside","Sign too big.  Use different post.","Sign too big.  Use different post.","Sign too big.  Use different post.","Sign too big.  Use different post.","Sign too big.  Use different post.","Sign too big.  Use different post.","Sign too big.  Use different post.","Sign too big.  Use different post."]
[8,7.5,3.75,60,"Sign too big.  Use different post.","Sign too big.  Use different post.","Sign too big.  Use different post.","Sign too big.  Use different post.","Sign too big.  Use different post.","Sign too big.  Use different post.","Sign too big.  Use different post.","Sign too big.  Use different post.","Sign too big.  Use different post."]
[8,8,4,64,"Sign too big.  Use different post.","Sign too big.  Use different post.","Sign too big.  Use different post.","Sign too big.  Use different post.","Sign too big.  Use different post.","Sign too big.  Use different post.","Sign too big.  Use different post.","Sign too big.  Use different post.","Sign too big.  Use different post."]
[]
["TRIPLE POST - 5' MOUNTING HEIGHT"]
[]
[null,null,null,null,5]
["width","height","centroid","area",5,6,7,8,9,10,11,12,13,14,15]
[6,1,{"$f":"B602/2","v":0.5},{"$f":"A602*B602","v":6},"-","-","-","-","-","-","-","-","-","-","-"]
[6,{"$f":"B602+0.5","v":1.5},{"$f":"B603/2","v":0.75},{"$f":"A603*B603","v":9},"-","-","-","-","-","-","-","-","-","-","-"]
[6,{"$f":"B603+0.5","v":2},1,12,"-","-","-","-","-","-","-","-","-","-","-"]
[6,2.5,1.25,15,"-","-","-","-","-","-","-","-","-","-","-"]
[6,3,1.5,18,"-","-","-","-","-","-","-","-","-","-","-"]
[6,3.5,1.75,21,"-","-","-","-","-","-","-","-","-","-","2.5\""]
[6,4,2,24,"-","-","-","-","-","-","-","-","2.5\"","2.5\"","2.5\""]
[6,4.5,2.25,27,"-","-","-","-","-","-","2.5\"","2.5\"","2.5\"","2.5\"","2.5\""]
[6,5,2.5,30,"-","-","-","-","2.5\"","2.5\"","2.5\"","2.5\"","2.5\"","2.5\"","-"]
[6,5.5,2.75,33,"-","-","-","2.5\"","2.5\"","2.5\"","2.5\"","2.5\"","-","-","2.5\" w/ 2.25\" inside"]
[6,6,3,36,"-","-","2.5\"","2.5\"","2.5\"","2.5\"","2.5\"","-","-","2.5\" w/ 2.25\" inside","2.5\" w/ 2.25\" inside"]
[6,6.5,3.25,39,"-","2.5\"","2.5\"","2.5\"","2.5\"","-","-","-","2.5\" w/ 2.25\" inside","2.5\" w/ 2.25\" inside","2.5\" w/ 2.25\" inside"]
[6,7,3.5,42,"2.5\"","2.5\"","2.5\"","2.5\"","-","-","-","2.5\" w/ 2.25\" inside","2.5\" w/ 2.25\" inside","2.5\" w/ 2.25\" inside","2.5\" w/ 2.25\" inside"]
[6,7.5,3.75,45,"2.5\"","2.5\"","2.5\"","-","-","2.5\" w/ 2.25\" inside","2.5\" w/ 2.25\" inside","2.5\" w/ 2.25\" inside","2.5\" w/ 2.25\" inside","2.5\" w/ 2.25\" inside","2.5\" w/ 2.25\" inside"]
[6,8,4,48,"2.5\"","2.5\"","-","-","2.5\" w/ 2.25\" inside","2.5\" w/ 2.25\" inside","2.5\" w/ 2.25\" inside","2.5\" w/ 2.25\" inside","2.5\" w/ 2.25\" inside","Sign too big.  Use different post.","Sign too big.  Use different post."]
[]
[null,null,null,null,5]
["width","height","centroid","area",5,6,7,8,9,10,11,12,13,14,15]
[6.5,1,{"$f":"B620/2","v":0.5},{"$f":"A620*B620","v":6.5},"-","-","-","-","-","-","-","-","-","-","-"]
[6.5,{"$f":"B620+0.5","v":1.5},{"$f":"B621/2","v":0.75},{"$f":"A621*B621","v":9.75},"-","-","-","-","-","-","-","-","-","-","-"]
[6.5,{"$f":"B621+0.5","v":2},1,13,"-","-","-","-","-","-","-","-","-","-","-"]
[6.5,2.5,1.25,16.25,"-","-","-","-","-","-","-","-","-","-","-"]
[6.5,3,1.5,19.5,"-","-","-","-","-","-","-","-","-","-","-"]
[6.5,3.5,1.75,22.75,"-","-","-","-","-","-","-","-","-","2.5\"","2.5\""]
[6.5,4,2,26,"-","-","-","-","-","-","-","2.5\"","2.5\"","2.5\"","2.5\""]
[6.5,4.5,2.25,29.25,"-","-","-","-","-","2.5\"","2.5\"","2.5\"","2.5\"","2.5\"","-"]
[6.5,5,2.5,32.5,"-","-","-","-","2.5\"","2.5\"","2.5\"","2.5\"","2.5\"","-","2.5\" w/ 2.25\" inside"]
[6.5,{"$f":"B628+0.5","v":5.5},2.75,35.75,"-","-","2.5\"","2.5\"","2.5\"","2.5\"","2.5\"","-","-","2.5\" w/ 2.25\" inside","2.5\" w/ 2.25\" inside"]
[6.5,6,3,39,"-","2.5\"","2.5\"","2.5\"","2.5\"","2.5\"","-","-","2.5\" w/ 2.25\" inside","2.5\" w/ 2.25\" inside","2.5\" w/ 2.25\" inside"]
[6.5,6.5,3.25,42.25,"2.5\"","2.5\"","2.5\"","2.5\"","-","-","-","2.5\" w/ 2.25\" inside","2.5\" w/ 2.25\" inside","2.5\" w/ 2.25\" inside","2.5\" w/ 2.25\" inside"]
[6.5,7,3.5,45.5,"2.5\"","2.5\"","2.5\"","-","-","-","2.5\" w/ 2.25\" inside","2.5\" w/ 2.25\" inside","2.5\" w/ 2.25\" inside","2.5\" w/ 2.25\" inside","2.5\" w/ 2.25\" inside"]
[6.5,{"$f":"B632+0.5","v":7.5},3.75,48.75,"2.5\"","2.5\"","-","-","2.5\" w/ 2.25\" inside","2.5\" w/ 2.25\" inside","2.5\" w/ 2.25\" inside","2.5\" w/ 2.25\" inside","2.5\" w/ 2.25\" inside","Sign too big.  Use different post.","Sign too big.  Use different post."]
[6.5,8,4,52,"2.5\"","-","-","2.5\" w/ 2.25\" inside","2.5\" w/ 2.25\" inside","2.5\" w/ 2.25\" inside","2.5\" w/ 2.25\" inside","2.5\" w/ 2.25\" inside","Sign too big.  Use different post.","Sign too big.  Use different post.","Sign too big.  Use different post."]
[]
[null,null,null,null,5]
["width","height","centroid","area",5,6,7,8,9,10,11,12,13,14,15]
[7,1,{"$f":"B638/2","v":0.5},{"$f":"A638*B638","v":7},"-","-","-","-","-","-","-","-","-","-","-"]
[7,{"$f":"B638+0.5","v":1.5},{"$f":"B639/2","v":0.75},{"$f":"A639*B639","v":10.5},"-","-","-","-","-","-","-","-","-","-","-"]
[7,{"$f":"B639+0.5","v":2},1,14,"-","-","-","-","-","-","-","-","-","-","-"]
[7,2.5,1.25,17.5,"-","-","-","-","-","-","-","-","-","-","-"]
[7,3,1.5,21,"-","-","-","-","-","-","-","-","-","-","2.5\""]
[7,3.5,1.75,24.5,"-","-","-","-","-","-","-","-","2.5\"","2.5\"","2.5\""]
[7,4,2,28,"-","-","-","-","-","-","2.5\"","2.5\"","2.5\"","2.5\"","-"]
[7,4.5,2.25,31.5,"-","-","-","-","2.5\"","2.5\"","2.5\"","2.5\"","2.5\"","-","-"]
[7,5,2.5,35,"-","-","-","2.5\"","2.5\"","2.5\"","2.5\"","2.5\"","-","-","2.5\" w/ 2.25\" inside"]
[7,5.5,2.75,38.5,"-","2.5\"","2.5\"","2.5\"","2.5\"","2.5\"","-","-","-","2.5\" w/ 2.25\" inside","2.5\" w/ 2.25\" inside"]
[7,6,3,42,"-","2.5\"","2.5\"","2.5\"","2.5\"","-","-","2.5\" w/ 2.25\" inside","2.5\" w/ 2.25\" inside","2.5\" w/ 2.25\" inside","2.5\" w/ 2.25\" inside"]
[7,6.5,3.25,45.5,"2.5\"","2.5\"","2.5\"","-","-","-","2.5\" w/ 2.25\" inside","2.5\" w/ 2.25\" inside","2.5\" w/ 2.25\" inside","2.5\" w/ 2.25\" inside","2.5\" w/ 2.25\" inside"]
[7,7,3.5,49,"2.5\"","2.5\"","2.5\"","-","-","2.5\" w/ 2.25\" inside","2.5\" w/ 2.25\" inside","2.5\" w/ 2.25\" inside","2.5\" w/ 2.25\" inside","Sign too big.  Use different post.","Sign too big.  Use different post."]
[7,7.5,3.75,52.5,"2.5\"","-","-","2.5\" w/ 2.25\" inside","2.5\" w/ 2.25\" inside","2.5\" w/ 2.25\" inside","2.5\" w/ 2.25\" inside","2.5\" w/ 2.25\" inside","Sign too big.  Use different post.","Sign too big.  Use different post.","Sign too big.  Use different post."]
[7,8,4,56,"2.5\"","-","-","2.5\" w/ 2.25\" inside","2.5\" w/ 2.25\" inside","2.5\" w/ 2.25\" inside","2.5\" w/ 2.25\" inside","2.5\" w/ 2.25\" inside","Sign too big.  Use different post.","Sign too big.  Use different post.","Sign too big.  Use different post."]
[]
[null,null,null,null,5]
["width","height","centroid","area",5,6,7,8,9,10,11,12,13,14,15]
[7.5,1,{"$f":"B656/2","v":0.5},{"$f":"A656*B656","v":7.5},"-","-","-","-","-","-","-","-","-","-","-"]
[7.5,{"$f":"B656+0.5","v":1.5},{"$f":"B657/2","v":0.75},{"$f":"A657*B657","v":11.25},"-","-","-","-","-","-","-","-","-","-","-"]
[7.5,{"$f":"B657+0.5","v":2},1,15,"-","-","-","-","-","-","-","-","-","-","-"]
[7.5,2.5,1.25,18.75,"-","-","-","-","-","-","-","-","-","-","-"]
[7.5,3,1.5,22.5,"-","-","-","-","-","-","-","-","2.5\"","2.5\"","2.5\""]
[7.5,3.5,1.75,26.25,"-","-","-","-","-","-","-","2.5\"","2.5\"","2.5\"","2.5\""]
[7.5,4,2,30,"-","-","-","-","-","2.5\"","2.5\"","2.5\"","2.5\"","2.5\"","-"]
[7.5,4.5,2.25,33.75,"-","-","-","2.5\"","2.5\"","2.5\"","2.5\"","2.5\"","-","-","2.5\" w/ 2.25\" inside"]
[7.5,5,2.5,37.5,"-","-","2.5\"","2.5\"","2.5\"","2.5\"","2.5\"","-","-","-","2.5\" w/ 2.25\" inside"]
[7.5,5.5,2.75,41.25,"-","2.5\"","2.5\"","2.5\"","2.5\"","-","-","-","2.5\" w/ 2.25\" inside","2.5\" w/ 2.25\" inside","2.5\" w/ 2.25\" inside"]
[7.5,6,3,45,"2.5\"","2.5\"","2.5\"","2.5\"","-","-","2.5\" w/ 2.25\" inside","2.5\" w/ 2.25\" inside","2.5\" w/ 2.25\" inside","2.5\" w/ 2.25\" inside","2.5\" w/ 2.25\" inside"]
[7.5,6.5,3.25,48.75,"2.5\"","2.5\"","2.5\"","-","-","2.5\" w/ 2.25\" inside","2.5\" w/ 2.25\" inside","2.5\" w/ 2.25\" inside","2.5\" w/ 2.25\" inside","2.5\" w/ 2.25\" inside","Sign too big.  Use different post."]
[7.5,7,3.5,52.5,"2.5\"","2.5\"","-","-","2.5\" w/ 2.25\" inside","2.5\" w/ 2.25\" inside","2.5\" w/ 2.25\" inside","2.5\" w/ 2.25\" inside","2.5\" w/ 2.25\" inside","Sign too big.  Use different post.","Sign too big.  Use different post."]
[7.5,7.5,3.75,56.25,"2.5\"","-","-","2.5\" w/ 2.25\" inside","2.5\" w/ 2.25\" inside","2.5\" w/ 2.25\" inside","2.5\" w/ 2.25\" inside","2.5\" w/ 2.25\" inside","Sign too big.  Use different post.","Sign too big.  Use different post.","Sign too big.  Use different post."]
[7.5,8,4,60,"-","-","2.5\" w/ 2.25\" inside","2.5\" w/ 2.25\" inside","2.5\" w/ 2.25\" inside","2.5\" w/ 2.25\" inside","2.5\" w/ 2.25\" inside","Sign too big.  Use different post.","Sign too big.  Use different post.","Sign too big.  Use different post.","Sign too big.  Use different post."]
[]
[null,null,null,null,5]
["width","height","centroid","area",5,6,7,8,9,10,11,12,13,14,15]
[8,1,{"$f":"B674/2","v":0.5},{"$f":"A674*B674","v":8},"-","-","-","-","-","-","-","-","-","-","-"]
[8,{"$f":"B674+0.5","v":1.5},{"$f":"B675/2","v":0.75},{"$f":"A675*B675","v":12},"-","-","-","-","-","-","-","-","-","-","-"]
[8,{"$f":"B675+0.5","v":2},1,16,"-","-","-","-","-","-","-","-","-","-","-"]
[8,2.5,1.25,20,"-","-","-","-","-","-","-","-","-","-","-"]
[8,3,1.5,24,"-","-","-","-","-","-","-","-","2.5\"","2.5\"","2.5\""]
[8,3.5,1.75,28,"-","-","-","-","-","-","2.5\"","2.5\"","2.5\"","2.5\"","2.5\""]
[8,4,2,32,"-","-","-","-","2.5\"","2.5\"","2.5\"","2.5\"","2.5\"","2.5\"","-"]
[8,4.5,2.25,36,"-","-","-","2.5\"","2.5\"","2.5\"","2.5\"","-","-","-","2.5\" w/ 2.25\" inside"]
[8,5,2.5,40,"-","-","2.5\"","2.5\"","2.5\"","2.5\"","-","-","2.5\" w/ 2.25\" inside","2.5\" w/ 2.25\" inside","2.5\" w/ 2.25\" inside"]
[8,5.5,2.75,44,"2.5\"","2.5\"","2.5\"","2.5\"","-","-","-","2.5\" w/ 2.25\" inside","2.5\" w/ 2.25\" inside","2.5\" w/ 2.25\" inside","2.5\" w/ 2.25\" inside"]
[8,6,3,48,"2.5\"","2.5\"","2.5\"","-","-","2.5\" w/ 2.25\" inside","2.5\" w/ 2.25\" inside","2.5\" w/ 2.25\" inside","2.5\" w/ 2.25\" inside","2.5\" w/ 2.25\" inside","Sign too big.  Use different post."]
[8,6.5,3.25,52,"2.5\"","2.5\"","-","-","2.5\" w/ 2.25\" inside","2.5\" w/ 2.25\" inside","2.5\" w/ 2.25\" inside","2.5\" w/ 2.25\" inside","2.5\" w/ 2.25\" inside","Sign too big.  Use different post.","Sign too big.  Use different post."]
[8,7,3.5,56,"2.5\"","-","-","2.5\" w/ 2.25\" inside","2.5\" w/ 2.25\" inside","2.5\" w/ 2.25\" inside","2.5\" w/ 2.25\" inside","2.5\" w/ 2.25\" inside","2.5\" w/ 2.25\" inside","Sign too big.  Use different post.","Sign too big.  Use different post."]
[8,7.5,3.75,60,"-","-","2.5\" w/ 2.25\" inside","2.5\" w/ 2.25\" inside","2.5\" w/ 2.25\" inside","2.5\" w/ 2.25\" inside","2.5\" w/ 2.25\" inside","Sign too big.  Use different post.","Sign too big.  Use different post.","Sign too big.  Use different post.","Sign too big.  Use different post."]
[8,8,4,64,"-","2.5\" w/ 2.25\" inside","2.5\" w/ 2.25\" inside","2.5\" w/ 2.25\" inside","2.5\" w/ 2.25\" inside","2.5\" w/ 2.25\" inside","Sign too big.  Use different post.","Sign too big.  Use different post.","Sign too big.  Use different post.","Sign too big.  Use different post.","Sign too big.  Use different post."]
[]
["TRIPLE POST - 7' MOUNTING HEIGHT"]
[]
[null,null,null,null,7]
["width","height","centroid","area",7,8,9,10,11,12,13,14,15]
[6,1,{"$f":"B694/2","v":0.5},{"$f":"A694*B694","v":6},"-","-","-","-","-","-","-","-","-"]
[6,{"$f":"B694+0.5","v":1.5},{"$f":"B695/2","v":0.75},{"$f":"A695*B695","v":9},"-","-","-","-","-","-","-","-","-"]
[6,{"$f":"B695+0.5","v":2},1,12,"-","-","-","-","-","-","-","-","-"]
[6,2.5,1.25,15,"-","-","-","-","-","-","-","-","-"]
[6,3,1.5,18,"-","-","-","-","-","-","-","-","-"]
[6,3.5,1.75,21,"-","-","-","-","-","-","-","-","Sign too big.  Use different post."]
[6,4,2,24,"-","-","-","-","-","-","2.5\"","2.5\"","Sign too big.  Use different post."]
[6,4.5,2.25,27,"-","-","-","-","2.5\"","2.5\"","2.5\"","2.5\"","Sign too big.  Use different post."]
[6,5,2.5,30,"-","-","2.5\"","2.5\"","2.5\"","2.5\"","2.5\"","2.5\"","Sign too big.  Use different post."]
[6,5.5,2.75,33,"-","2.5\"","2.5\"","2.5\"","2.5\"","2.5\"","-","Sign too big.  Use different post.","Sign too big.  Use different post."]
[6,6,3,36,"2.5\"","2.5\"","2.5\"","2.5\"","2.5\"","-","-","Sign too big.  Use different post.","Sign too big.  Use different post."]
[6,6.5,3.25,39,"2.5\"","2.5\"","2.5\"","-","-","-","2.5\" w/ 2.25\" inside","Sign too big.  Use different post.","Sign too big.  Use different post."]
[6,7,3.5,42,"2.5\"","2.5\"","-","-","-","2.5\" w/ 2.25\" inside","2.5\" w/ 2.25\" inside","Sign too big.  Use different post.","Sign too big.  Use different post."]
[6,7.5,3.75,45,"2.5\"","-","-","2.5\" w/ 2.25\" inside","2.5\" w/ 2.25\" inside","2.5\" w/ 2.25\" inside","Sign too big.  Use different post.","Sign too big.  Use different post.","Sign too big.  Use different post."]
[6,8,4,48,"-","-","2.5\" w/ 2.25\" inside","2.5\" w/ 2.25\" inside","2.5\" w/ 2.25\" inside","2.5\" w/ 2.25\" inside","Sign too big.  Use different post.","Sign too big.  Use different post.","Sign too big.  Use different post."]
[]
[null,null,null,null,7]
["width","height","centroid","area",7,8,9,10,11,12,13,14,15]
[6.5,1,{"$f":"B712/2","v":0.5},{"$f":"A712*B712","v":6.5},"-","-","-","-","-","-","-","-","-"]
[6.5,{"$f":"B712+0.5","v":1.5},{"$f":"B713/2","v":0.75},{"$f":"A713*B713","v":9.75},"-","-","-","-","-","-","-","-","-"]
[6.5,{"$f":"B713+0.5","v":2},1,13,"-","-","-","-","-","-","-","-","-"]
[6.5,2.5,1.25,16.25,"-","-","-","-","-","-","-","-","-"]
[6.5,3,1.5,19.5,"-","-","-","-","-","-","-","-","-"]
[6.5,3.5,1.75,22.75,"-","-","-","-","-","-","-","2.5\"","Sign too big.  Use different post."]
[6.5,4,2,26,"-","-","-","-","-","2.5\"","2.5\"","2.5\"","Sign too big.  Use different post."]
[6.5,4.5,2.25,29.25,"-","-","-","2.5\"","2.5\"","2.5\"","2.5\"","2.5\"","Sign too big.  Use different post."]
[6.5,5,2.5,32.5,"-","-","2.5\"","2.5\"","2.5\"","2.5\"","2.5\"","-","Sign too big.  Use different post."]
[6.5,{"$f":"B720+0.5","v":5.5},2.75,35.75,"2.5\"","2.5\"","2.5\"","2.5\"","2.5\"","-","-","Sign too big.  Use different post.","Sign too big.  Use different post."]
[6.5,6,3,39,"2.5\"","2.5\"","2.5\"","2.5\"","-","-","2.5\" w/ 2.25\" inside","Sign too big.  Use different post.","Sign too big.  Use different post."]
[6.5,6.5,3.25,42.25,"2.5\"","2.5\"","-","-","-","2.5\" w/ 2.25\" inside","2.5\" w/ 2.25\" inside","Sign too big.  Use different post.","Sign too big.  Use different post."]
[6.5,7,3.5,45.5,"2.5\"","-","-","-","2.5\" w/ 2.25\" inside","2.5\" w/ 2.25\" inside","2.5\" w/ 2.25\" inside","Sign too big.  Use different post.","Sign too big.  Use different post."]
[6.5,{"$f":"B724+0.5","v":7.5},3.75,48.75,"-","-","2.5\" w/ 2.25\" inside","2.5\" w/ 2.25\" inside","2.5\" w/ 2.25\" inside","2.5\" w/ 2.25\" inside","Sign too big.  Use different post.","Sign too big.  Use different post.","Sign too big.  Use different post."]
[6.5,8,4,52,"-","2.5\" w/ 2.25\" inside","2.5\" w/ 2.25\" inside","2.5\" w/ 2.25\" inside","2.5\" w/ 2.25\" inside","2.5\" w/ 2.25\" inside","Sign too big.  Use different post.","Sign too big.  Use different post.","Sign too big.  Use different post."]
[]
[null,null,null,null,7]
["width","height","centroid","area",7,8,9,10,11,12,13,14,15]
[7,1,{"$f":"B730/2","v":0.5},{"$f":"A730*B730","v":7},"-","-","-","-","-","-","-","-","-"]
[7,{"$f":"B730+0.5","v":1.5},{"$f":"B731/2","v":0.75},{"$f":"A731*B731","v":10.5},"-","-","-","-","-","-","-","-","-"]
[7,{"$f":"B731+0.5","v":2},1,14,"-","-","-","-","-","-","-","-","-"]
[7,2.5,1.25,17.5,"-","-","-","-","-","-","-","-","-"]
[7,3,1.5,21,"-","-","-","-","-","-","-","-","2.5\""]
[7,3.5,1.75,24.5,"-","-","-","-","-","-","2.5\"","2.5\"","Sign too big.  Use different post."]
[7,4,2,28,"-","-","-","-","2.5\"","2.5\"","2.5\"","2.5\"","Sign too big.  Use different post."]
[7,4.5,2.25,31.5,"-","-","2.5\"","2.5\"","2.5\"","2.5\"","2.5\"","-","Sign too big.  Use different post."]
[7,5,2.5,35,"-","2.5\"","2.5\"","2.5\"","2.5\"","2.5\"","-","-","Sign too big.  Use different post."]
[7,5.5,2.75,38.5,"2.5\"","2.5\"","2.5\"","2.5\"","-","-","-","Sign too big.  Use different post.","Sign too big.  Use different post."]
[7,6,3,42,"2.5\"","2.5\"","2.5\"","-","-","2.5\" w/ 2.25\" inside","2.5\" w/ 2.25\" inside","Sign too big.  Use different post.","Sign too big.  Use different post."]
[7,6.5,3.25,45.5,"2.5\"","-","-","-","2.5\" w/ 2.25\" inside","2.5\" w/ 2.25\" inside","2.5\" w/ 2.25\" inside","Sign too big.  Use different post.","Sign too big.  Use different post."]
[7,7,3.5,49,"2.5\"","-","-","2.5\" w/ 2.25\" inside","2.5\" w/ 2.25\" inside","2.5\" w/ 2.25\" inside","2.5\" w/ 2.25\" inside","Sign too big.  Use different post.","Sign too big.  Use different post."]
[7,7.5,3.75,52.5,"-","2.5\" w/ 2.25\" inside","2.5\" w/ 2.25\" inside","2.5\" w/ 2.25\" inside","2.5\" w/ 2.25\" inside","2.5\" w/ 2.25\" inside","Sign too big.  Use different post.","Sign too big.  Use different post.","Sign too big.  Use different post."]
[7,8,4,56,"-","2.5\" w/ 2.25\" inside","2.5\" w/ 2.25\" inside","2.5\" w/ 2.25\" inside","2.5\" w/ 2.25\" inside","2.5\" w/ 2.25\" inside","Sign too big.  Use different post.","Sign too big.  Use different post.","Sign too big.  Use different post."]
[]
[null,null,null,null,7]
["width","height","centroid","area",7,8,9,10,11,12,13,14,15]
[7.5,1,{"$f":"B748/2","v":0.5},{"$f":"A748*B748","v":7.5},"-","-","-","-","-","-","-","-","-"]
[7.5,{"$f":"B748+0.5","v":1.5},{"$f":"B749/2","v":0.75},{"$f":"A749*B749","v":11.25},"-","-","-","-","-","-","-","-","-"]
[7.5,{"$f":"B749+0.5","v":2},1,15,"-","-","-","-","-","-","-","-","-"]
[7.5,2.5,1.25,18.75,"-","-","-","-","-","-","-","-","-"]
[7.5,3,1.5,22.5,"-","-","-","-","-","-","-","2.5\"","2.5\""]
[7.5,3.5,1.75,26.25,"-","-","-","-","-","2.5\"","2.5\"","2.5\"","Sign too big.  Use different post."]
[7.5,4,2,30,"-","-","-","2.5\"","2.5\"","2.5\"","2.5\"","2.5\"","Sign too big.  Use different post."]
[7.5,4.5,2.25,33.75,"-","2.5\"","2.5\"","2.5\"","2.5\"","2.5\"","-","-","Sign too big.  Use different post."]
[7.5,5,2.5,37.5,"2.5\"","2.5\"","2.5\"","2.5\"","2.5\"","-","-","-","Sign too big.  Use different post."]
[7.5,5.5,2.75,41.25,"2.5\"","2.5\"","2.5\"","-","-","-","2.5\" w/ 2.25\" inside","Sign too big.  Use different post.","Sign too big.  Use different post."]
[7.5,6,3,45,"2.5\"","2.5\"","-","-","2.5\" w/ 2.25\" inside","2.5\" w/ 2.25\" inside","2.5\" w/ 2.25\" inside","Sign too big.  Use different post.","Sign too big.  Use different post."]
[7.5,6.5,3.25,48.75,"2.5\"","-","-","2.5\" w/ 2.25\" inside","2.5\" w/ 2.25\" inside","2.5\" w/ 2.25\" inside","2.5\" w/ 2.25\" inside","Sign too big.  Use different post.","Sign too big.  Use different post."]
[7.5,7,3.5,52.5,"-","-","2.5\" w/ 2.25\" inside","2.5\" w/ 2.25\" inside","2.5\" w/ 2.25\" inside","2.5\" w/ 2.25\" inside","2.5\" w/ 2.25\" inside","Sign too big.  Use different post.","Sign too big.  Use different post."]
[7.5,7.5,3.75,56.25,"-","2.5\" w/ 2.25\" inside","2.5\" w/ 2.25\" inside","2.5\" w/ 2.25\" inside","2.5\" w/ 2.25\" inside","2.5\" w/ 2.25\" inside","Sign too big.  Use different post.","Sign too big.  Use different post.","Sign too big.  Use different post."]
[7.5,8,4,60,"2.5\" w/ 2.25\" inside","2.5\" w/ 2.25\" inside","2.5\" w/ 2.25\" inside","2.5\" w/ 2.25\" inside","2.5\" w/ 2.25\" inside","Sign too big.  Use different post.","Sign too big.  Use different post.","Sign too big.  Use different post.","Sign too big.  Use different post."]
[]
[null,null,null,null,7]
["width","height","centroid","area",7,8,9,10,11,12,13,14,15]
[8,1,{"$f":"B766/2","v":0.5},{"$f":"A766*B766","v":8},"-","-","-","-","-","-","-","-","-"]
[8,{"$f":"B766+0.5","v":1.5},{"$f":"B767/2","v":0.75},{"$f":"A767*B767","v":12},"-","-","-","-","-","-","-","-","-"]
[8,{"$f":"B767+0.5","v":2},1,16,"-","-","-","-","-","-","-","-","-"]
[8,2.5,1.25,20,"-","-","-","-","-","-","-","-","-"]
[8,3,1.5,24,"-","-","-","-","-","-","2.5\"","2.5\"","2.5\""]
[8,3.5,1.75,28,"-","-","-","-","2.5\"","2.5\"","2.5\"","2.5\"","Sign too big.  Use different post."]
[8,4,2,32,"-","-","2.5\"","2.5\"","2.5\"","2.5\"","2.5\"","2.5\"","Sign too big.  Use different post."]
[8,4.5,2.25,36,"-","2.5\"","2.5\"","2.5\"","2.5\"","-","-","-","Sign too big.  Use different post."]
[8,5,2.5,40,"2.5\"","2.5\"","2.5\"","2.5\"","-","-","2.5\" w/ 2.25\" inside","2.5\" w/ 2.25\" inside","Sign too big.  Use different post."]
[8,5.5,2.75,44,"2.5\"","2.5\"","-","-","-","2.5\" w/ 2.25\" inside","2.5\" w/ 2.25\" inside","Sign too big.  Use different post.","Sign too big.  Use different post."]
[8,6,3,48,"2.5\"","-","-","2.5\" w/ 2.25\" inside","2.5\" w/ 2.25\" inside","2.5\" w/ 2.25\" inside","2.5\" w/ 2.25\" inside","Sign too big.  Use different post.","Sign too big.  Use different post."]
[8,6.5,3.25,52,"-","-","2.5\" w/ 2.25\" inside","2.5\" w/ 2.25\" inside","2.5\" w/ 2.25\" inside","2.5\" w/ 2.25\" inside","2.5\" w/ 2.25\" inside","Sign too big.  Use different post.","Sign too big.  Use different post."]
[8,7,3.5,56,"-","2.5\" w/ 2.25\" inside","2.5\" w/ 2.25\" inside","2.5\" w/ 2.25\" inside","2.5\" w/ 2.25\" inside","2.5\" w/ 2.25\" inside","2.5\" w/ 2.25\" inside","Sign too big.  Use different post.","Sign too big.  Use different post."]
[8,7.5,3.75,60,"2.5\" w/ 2.25\" inside","2.5\" w/ 2.25\" inside","2.5\" w/ 2.25\" inside","2.5\" w/ 2.25\" inside","2.5\" w/ 2.25\" inside","Sign too big.  Use different post.","Sign too big.  Use different post.","Sign too big.  Use different post.","Sign too big.  Use different post."]
[8,8,4,64,"2.5\" w/ 2.25\" inside","2.5\" w/ 2.25\" inside","2.5\" w/ 2.25\" inside","2.5\" w/ 2.25\" inside","Sign too big.  Use different post.","Sign too big.  Use different post.","Sign too big.  Use different post.","Sign too big.  Use different post.","Sign too big.  Use different post."]

{"sheet":"Channel Post Selector","index":5,"n_rows":30,"n_cols":26,"rows_kept":30,"cut":false,"hidden":false,"merged":[[24,3,31,3],[10,16,10,22],[24,2,31,2],[1,0,1,27],[24,1,31,1],[24,25,31,25],[9,25,9,26],[11,16,11,22],[0,0,0,27],[5,3,5,8],[3,5,3,23],[11,23,11,24],[10,25,10,26],[9,8,9,10],[10,11,10,13],[12,16,12,22],[9,23,9,24],[10,23,10,24],[9,16,9,22],[9,3,9,7],[11,25,11,26],[10,8,10,10],[6,3,6,25],[10,3,10,7],[9,11,9,13]]}
["Channel Mounted Sign Post Selector"]
[]
[]
[null,null,null,"Sign:"]
[]
[null,null,null,"Instructions"]
[null,null,null,"-Fill in all shaded boxes."]
[null,null,null,"-Press the Enter key after each selection."]
[]
[null,null,null,"Sign",null,null,null,null,"width ft.",null,null,null,null,null,null,null,"Number of Posts:",null,null,null,null,null,null,{"$f":"(IF(L10=0,\" \",(IF(X12>30,\"Error\",IF(L10>8,\"Error\",IF(X12=0,0,IF(AND(X12<=24,L10>=4),2,IF(AND(X12>10,X12<=24,L10<4),2,IF(AND(X12<=10,L10<4),1,IF(X12>24,3,\" \"))))))))))","v":" "}]
[null,null,null,"Dimensions",null,null,null,null,"height ft.",null,null,null,null,null,null,null,"Post Size:",null,null,null,null,null,null,{"$f":"IF(L10=0,\" \",IF(OR(L10=5.5,L10=6.5,L10=7.5),0,IF(X12=0,0,IF(X12>0,3))))","v":" "},null,"lb/ft"]
[null,null,null,null,null,null,null,null,null,null,null,null,null,null,null,null,"Sign Size:",null,null,null,null,null,null,{"$f":"IF(L10=0,0,L11*L10)","v":0},null,"sq. ft."]
[null,null,null,null,null,null,null,{"$f":"(IF(X12>30,\"Sign Too Big: Use Structural Post\",(IF(L10>8,\"Too Wide For 2 Channel Posts: Use Structural\",\" \"))))","v":" "},null,null,null,null,null,null,null,null,"Sign Type:",null,null,null,null,null,null,{"$f":"IF(L10=0,\" \",IF(OR(L10=5.5,L10=6.5,L10=7.5),\"Use 1 ft Increments for Extruded\",IF(AND(X12<=30,L10<6),\"Flat Sheet\",\"Extruded\")))","v":" "}]
[]
[]
[]
[]
[]
[]
[]
[]
[]
[]
[]
[null,"MIN 5 ft - Rural","OR","MIN 7ft - Urban",null,null,null,null,null,null,null,null,null,null,null,null,null,null,null,null,null,null,null,null,null,"Not less then 5 ft"]
[]
[]
[]
[null,null,null,null,{"$f":"IF(X10=3,TRUNC((1/6)*L10),\"-\")","v":"-"},"ft",null,{"$f":"IF(X10=3,TRUNC((1/3)*L10),\"-\")","v":"-"},"ft",null,{"$f":"IF(X10=3,TRUNC((1/3)*L10),\"-\")","v":"-"},"ft",null,{"$f":"IF(X10=3,TRUNC((1/6)*L10),\"-\")","v":"-"},"ft",null,{"$f":"IF(X10=2,TRUNC((1/5)*L10), \"-\")","v":"-"},"ft",null,null,{"$f":"IF(X10=2,TRUNC((3/5)*L10),\"-\")","v":"-"},"ft",null,{"$f":"IF(X10=2,TRUNC((1/5)*L10), \"-\")","v":"-"},"ft"]
[null,null,null,null,{"$f":"IF(X10=3,(((1/6)*L10)-E29)*12,\"-\")","v":"-"},"in",null,{"$f":"IF(X10=3,(((1/3)*L10)-H29)*12,\"-\")","v":"-"},"in",null,{"$f":"IF(X10=3,(((1/3)*L10)-K29)*12,\"-\")","v":"-"},"in",null,{"$f":"IF(X10=3,(((1/6)*L10)-N29)*12,\"-\")","v":"-"},"in",null,{"$f":"IF(X10=2,(((1/5)*L10)-Q29)*12,\"-\")","v":"-"},"in",null,null,{"$f":"IF(X10=2,(((3/5)*L10)-U29)*12,\"-\")","v":"-"},"in",null,{"$f":"IF(X10=2,(((1/5)*L10)-X29)*12,\"-\")","v":"-"},"in"]