{"text_format":"1","workbook":"xlsx","n_sheets":16,"sheets":["Rearrange","VolumeLookup","Unique Values","Reference Sheet","HCM 2010 Program","WZ Analysis (Worksheet)","ADV WZ Calcs","Acceleration Calcs","Step 1 - Introduction","Step 2 - Facility Data Inputs","Step 3 - WZ Analysis","Step 3a - ADV WZ Analysis","Step 3b - Acceleration Analysis","Step 4 - Synopsis Sheet","Step 4a - ADV WZ Synopsis","Step 4b - Acceleration Synopsis"],"not_rendered":{"charts":12,"images":1,"macros":1,"external_links":0,"defined_names":3,"comments":4,"pivot_tables":0},"unopened":[],"bounds":{"document_bytes":16777216,"sheet_cells":100000,"rows_first":2000,"rows_last":500,"rows_between":2000,"halvings":0,"cell_chars":16384,"cell_head_chars":4096},"cells_cut":0,"cells_raw":0,"read":"whole","date_system":"1900"}

{"sheet":"Rearrange","index":0,"n_rows":38,"n_cols":2,"rows_kept":38,"cut":false,"hidden":true,"merged":[[0,0,0,14]]}
[]
[]
[]
[]
["Rearranged Data"]
["Segment",{"$f":"REPLACE(LEFT(A1,SEARCH(\"Type:\",A1)-4),1,LOOKUP(9.99999999999999E+307,FIND(\" \",LEFT(A1,SEARCH(\"Segment:\",A1)+9),ROW(INDIRECT(\"1:\"&LEN(A1))))),\"\")","v":{"$error":"#VALUE!"}}]
{"$rows_left_out":33}
{"sheet":"VolumeLookup","index":1,"n_rows":31,"n_cols":2,"rows_kept":31,"cut":false,"hidden":true,"merged":[]}
["Lookup",{"$f":"Rearrange!B38","v":{"$error":"#VALUE!"}}]
["Segment"]
["Logs"]
["Location Summary"]
["Lanes"]
["Date"]
{"$rows_left_out":26}
{"sheet":"Unique Values","index":2,"n_rows":1,"n_cols":4,"rows_kept":1,"cut":false,"hidden":true,"merged":[]}
["Location","Location","Date","Date"]

{"sheet":"Reference Sheet","index":3,"n_rows":235,"n_cols":28,"rows_kept":235,"cut":false,"hidden":true,"merged":[]}
["DISTRICTS:",null,"COUNTY:","COUNTY:","ROUTE:",null,"ROUTE:",null,"I","US","MO","RT",null,"STATE SYSTEM CLASS",null,"ROADWAY TYPE",null,null,"Work Location",null,null,"Travel Lane Width (ft)",null,"Climbing Grade (%)*",null,"Speed Limit","Binary","Construction Seasons"]
["Northwest",null,"Adair County","Adair","I-29 (MO).svgI-29",null,"I-29",null,"29","24","1","29",null,"INTERSTATE",null,"FREEWAY",null,"No Work Zone (Use for Calibrating Existing Conditions)","Barrier located greater than 2 feet from travel lane",9,null,"<10 ",3,"< 2",0,30,"Yes","more than one"]
["Northeast",null,"Andrew County","Andrew","I-35 (MO).svgI-35",null,"I-35",null,"35","36","2","35",null,"PRIMARY",null,"EXPRESSWAY",null,"Workers & equipment less than 4 feet from travel lane","Barrier located less than 2 feet from travel lane",6,null,"> 11.5",1,">2-3",1,35,"No","one or somewhat less than one"]
["Kansas City",null,"Atchison County","Atchison","I-44 (MO).svgI-44",null,"I-44",null,"44","40","3","44",null,"SUPPLEMENTARY",null,"MULTI-LANE",null,"Workers & equipment greater than 4-feet from travel lane","Crossover on Divided Highway",15,null,"10 - 11.5",2,">3-4",4,40,"N/A","much less than one"]
["Central",null,"Audrain County","Audrain","I-49 (MO).svgI-49",null,"I-49",null,"49","50","5","49",null,"NOT ON SYSTEM",null,"5 LANE SECTION",null,"Barrier located less than 2 feet from travel lane","No Work Zone (Use for Calibrating Existing Conditions)",538,null,null,null,">4-5",7,45]
["Saint Louis",null,"Barry County","Barry","I-55 (MO).svgI-55",null,"I-55",null,"55","54","6","55",null,"UNKNOWN",null,"3 LANE SECTION",null,"Barrier located greater than 2 feet from travel lane","Ramp (used as bypass)",12,null,null,null,">5-6",10,50]
{"$rows_left_out":230}
{"sheet":"HCM 2010 Program","index":4,"n_rows":52,"n_cols":15,"rows_kept":52,"cut":false,"hidden":true,"merged":[[31,3,31,14],[32,3,32,14],[2,0,4,0],[5,0,7,0],[14,0,16,0],[17,0,19,0],[31,0,33,0],[31,1,33,1],[11,0,13,0],[8,0,10,0],[36,0,38,0],[39,0,41,0],[42,0,44,0],[45,0,47,0],[48,0,50,0]]}
["Highway Capacity Manual 2010 Program for the MoDOT's Work Zone Impact Analysis Spreadsheet"]
["Work Location","Travel Lane Width (ft)",null,"Capacity of Work Zone Before Trucks (pc/h/ln)","Percent of Trucks*","ET - Equivalent Truck*","Lane Width Factor      (fLW)","Capacity (w/Trucks) veh/lane/hr"]
["Workers & equipment less than 4 feet from travel lane","> 11.5",1,1440,{"$f":"'Step 2 - Facility Data Inputs'!$E$15","v":0.05},{"$f":"VLOOKUP(('Step 2 - Facility Data Inputs'!$G$16+'Step 2 - Facility Data Inputs'!$I$16),$C$36:$O$51,'Step 2 - Facility Data Inputs'!$E$16)","v":1.5},1,{"$f":"+(D3*(1/(1+(E3*(F3-1)))))*G3","v":1404.8780487804879}]
[null,"10 - 11.5",2,1440,{"$f":"'Step 2 - Facility Data Inputs'!$E$15","v":0.05},{"$f":"VLOOKUP(('Step 2 - Facility Data Inputs'!$G$16+'Step 2 - Facility Data Inputs'!$I$16),$C$36:$O$51,'Step 2 - Facility Data Inputs'!$E$16)","v":1.5},0.91,{"$f":"+(D4*(1/(1+(E4*(F4-1)))))*G4","v":1278.439024390244}]
[null,"<10 ",3,1440,{"$f":"'Step 2 - Facility Data Inputs'!$E$15","v":0.05},{"$f":"VLOOKUP(('Step 2 - Facility Data Inputs'!$G$16+'Step 2 - Facility Data Inputs'!$I$16),$C$36:$O$51,'Step 2 - Facility Data Inputs'!$E$16)","v":1.5},0.86,1208.1951219512196]
["Workers & equipment greater than 4-feet from travel lane","> 11.5",4,1600,{"$f":"'Step 2 - Facility Data Inputs'!$E$15","v":0.05},{"$f":"VLOOKUP(('Step 2 - Facility Data Inputs'!$G$16+'Step 2 - Facility Data Inputs'!$I$16),$C$36:$O$51,'Step 2 - Facility Data Inputs'!$E$16)","v":1.5},1,1560.9756097560978]
{"$rows_left_out":47}
{"sheet":"WZ Analysis (Worksheet)","index":5,"n_rows":221,"n_cols":33,"rows_kept":221,"cut":false,"hidden":true,"merged":[[193,0,213,0],[198,3,198,5],[199,3,199,5],[200,3,200,5],[201,3,201,5],[204,3,204,5],[205,3,205,5],[206,3,206,5],[164,0,184,0],[169,3,169,5],[170,3,170,5],[171,3,171,5],[172,3,172,5],[175,3,175,5],[176,3,176,5],[177,3,177,5],[135,0,155,0],[140,3,140,5],[141,3,141,5],[142,3,142,5],[143,3,143,5],[146,3,146,5],[147,3,147,5],[148,3,148,5],[106,0,126,0],[111,3,111,5],[112,3,112,5],[113,3,113,5],[114,3,114,5],[117,3,117,5],[118,3,118,5],[119,3,119,5],[77,0,97,0],[82,3,82,5],[83,3,83,5],[84,3,84,5],[85,3,85,5],[88,3,88,5],[89,3,89,5],[90,3,90,5],[48,0,68,0],[53,3,53,5],[54,3,54,5],[55,3,55,5],[56,3,56,5],[59,3,59,5],[60,3,60,5],[61,3,61,5],[32,3,32,5],[24,3,24,5],[19,0,39,0],[25,3,25,5],[26,3,26,5],[27,3,27,5],[30,3,30,5],[31,3,31,5]]}
[null,null,null,null,null,null,null,"WORKSHEET"]
[]
[null,null,null,null,null,null,null,"WORKZONE DETAILS"]
[]
[]
[]
{"$rows_left_out":216}
{"sheet":"ADV WZ Calcs","index":6,"n_rows":37,"n_cols":111,"rows_kept":37,"cut":false,"hidden":true,"merged":[[0,88,0,98],[1,88,1,89],[1,90,1,94],[1,95,1,97],[1,98,2,98],[0,76,0,86],[1,76,1,77],[1,78,1,82],[1,83,1,85],[1,86,2,86],[0,64,0,74],[1,64,1,65],[1,66,1,70],[1,71,1,73],[1,74,2,74],[0,28,0,38],[1,28,1,29],[1,30,1,34],[1,35,1,37],[1,38,2,38],[1,4,1,5],[1,6,1,10],[1,11,1,13],[1,14,2,14],[0,4,0,14],[0,16,0,26],[1,16,1,17],[1,18,1,22],[1,23,1,25],[1,26,2,26],[0,40,0,50],[1,40,1,41],[1,42,1,46],[1,47,1,49],[1,50,2,50],[0,52,0,62],[1,52,1,53],[1,54,1,58],[1,59,1,61],[1,62,2,62],[0,100,0,110],[1,100,1,101],[1,102,1,106],[1,107,1,109],[1,110,2,110]]}
[null,null,null,null,"1. Construction Vehicle Warning System",null,null,null,null,null,null,null,null,null,null,null,"2. Dynamic Late Merge (Zipper Merge) System",null,null,null,null,null,null,null,null,null,null,null,"8. Travel Time Advisory System",null,null,null,null,null,null,null,null,null,null,null,"9. Travel Time Advisory System with Alternative Route",null,null,null,null,null,null,null,null,null,null,null,"3. Queue Warning System",null,null,null,null,null,null,null,null,null,null,null,"4. Road Closure",null,null,null,null,null,null,null,null,null,null,null,"5. Speed Warning System",null,null,null,null,null,null,null,null,null,null,null,"7. Temporary Traffic Incident Management and ITS System",null,null,null,null,null,null,null,null,null,null,null,"6. Temporary Rumble Strips"]
[null,null,null,null,"Pass/Fail Criteria",null,"Scoring",null,null,null,null,"Costs",null,null,"Comments",null,"Pass/Fail Criteria",null,"Scoring Calculations",null,null,null,null,"Costs",null,null,"Comments",null,"Pass/Fail Criteria",null,"Scoring Calculations",null,null,null,null,"Costs",null,null,"Comments",null,"Pass/Fail Criteria",null,"Scoring Calculations",null,null,null,null,"Costs",null,null,"Comments",null,"Pass/Fail Criteria",null,"Scoring Calculations",null,null,null,null,"Costs",null,null,"Comments",null,"Pass/Fail Criteria",null,"Scoring Calculations",null,null,null,null,"Costs",null,null,"Comments",null,"Pass/Fail Criteria",null,"Scoring Calculations",null,null,null,null,"Costs",null,null,"Comments",null,"Pass/Fail Criteria",null,"Scoring Calculations",null,null,null,null,"Costs",null,null,"Comments",null,"Pass/Fail Criteria",null,"Scoring Calculations",null,null,null,null,"Costs",null,null,"Comments"]
["Question / Criteria","Value","Unit",null,"Minimum Threshold","Result","Lower Threshold","Upper Threshold","Lower Limit Score","Upper Limit Score","Score","Base Cost","Weekly Maint Cost","Total Cost",null,null,"Minimum Threshold","Result","Lower Threshold","Upper Threshold","Lower Limit Score","Upper Limit Score","Score","Base Cost","Weekly Maint Cost","Total Cost",null,null,"Minimum Threshold","Result","Lower Threshold","Upper Threshold","Lower Limit Score","Upper Limit Score","Score","Base Cost","Weekly Maint Cost","Total Cost",null,null,"Minimum Threshold","Result","Lower Threshold","Upper Threshold","Lower Limit Score","Upper Limit Score","Score","Base Cost","Weekly Maint Cost","Total Cost",null,null,"Minimum Threshold","Result","Lower Threshold","Upper Threshold","Lower Limit Score","Upper Limit Score","Score","Base Cost","Weekly Maint Cost","Total Cost",null,null,"Minimum Threshold","Result","Lower Threshold","Upper Threshold","Lower Limit Score","Upper Limit Score","Score","Base Cost","Weekly Maint Cost","Total Cost",null,null,"Minimum Threshold","Result","Lower Threshold","Upper Threshold","Lower Limit Score","Upper Limit Score","Score","Base Cost","Weekly Maint Cost","Total Cost",null,null,"Minimum Threshold","Result","Lower Threshold","Upper Threshold","Lower Limit Score","Upper Limit Score","Score","Base Cost","Weekly Maint Cost","Total Cost",null,null,"Minimum Threshold","Result","Lower Threshold","Upper Threshold","Lower Limit Score","Upper Limit Score","Score","Base Cost","Weekly Maint Cost","Total Cost"]
[{"$f":"'Step 3a - ADV WZ Analysis'!A10","v":"Facility Speed Limit (mph)"},{"$f":"'Step 3a - ADV WZ Analysis'!C10","v":0},"mph",null,null,null,null,null,null,null,null,null,null,null,null,null,40,{"$f":"B4>=Q4","v":false},40,65,3,10,{"$f":"IF($B4<=S4,U4,IF($B4>=T4,V4,U4+(V4-U4)*($B4-S4)/(T4-S4)))","v":3},null,null,null,"Approach speed must be at least 50 mph. Higher approach speeds increase the probability of conflicts and crashes at the back of a queue.",null,null,null,null,null,null,null,null,null,null,null,null,null,null,null,null,null,null,null,null,null,null,null,null,null,null,null,40,65,3,10,{"$f":"IF($B4<=BC4,BE4,IF($B4>=BD4,BF4,BE4+(BF4-BE4)*($B4-BC4)/(BD4-BC4)))","v":3},null,null,null,"Higher speeds increase risk for vehicles approaching the back of a queue",null,null,null,null,null,null,null,null,null,null,null,"Higher speeds increase risk for vehicles approaching the back of a queue",null,45,{"$f":"BY4<=B4","v":false},35,55,2,8,{"$f":"IF($B4<=CA4,CC4,IF($B4>=CB4,CD4,CC4+(CD4-CC4)*($B4-CA4)/(CB4-CA4)))","v":2},null,null,null,"Applicable in work zones with higher speeds",null,55,{"$f":"$B4>=CK4","v":false},55,70,1,10,{"$f":"IF($B4<=CM4,CO4,IF($B4>=CN4,CP4,CO4+(CP4-CO4)*($B4-CM4)/(CN4-CM4)))","v":1},null,null,null,null,null,35,{"$f":"$B4>=CW4","v":false},35,60,5,10,{"$f":"IF($B4<=CY4,DA4,IF($B4>=CZ4,DB4,DA4+(DB4-DA4)*($B4-CY4)/(CZ4-CY4)))","v":5},2000,null,{"$f":"DD4","v":2000},"Assumes 1 set and 1 approach"]
[{"$f":"'Step 3a - ADV WZ Analysis'!A12","v":"Are traffic patterns inconsistent from day to day? (e.g. unpredictible with \nsubstantial variability or impacts from random local traffic genertors)"},{"$f":"'Step 3a - ADV WZ Analysis'!C12","v":0},"Y/N",null,null,null,null,null,null,null,null,null,null,null,null,null,null,null,"No","Yes",3,10,{"$f":"IF($B5<=S5,U5,IF($B5>=T5,V5,U5+(V5-U5)*($B5-S5)/(T5-S5)))","v":3},null,null,null,null,null,null,null,"No","Yes",3,10,{"$f":"IF($B5<=AE5,AG5,IF($B5>=AF5,AH5,AG5+(AH5-AG5)*($B5-AE5)/(AF5-AE5)))","v":3},null,null,null,"TT Advisory systems are more useful when traffic is inconsistent.",null,null,null,"No","Yes",3,10,{"$f":"IF($B5<=AQ5,AS5,IF($B5>=AR5,AT5,AS5+(AT5-AS5)*($B5-AQ5)/(AR5-AQ5)))","v":3},null,null,null,"Variability increases the value of a TT/Alt Route system",null,null,null,"No","Yes",3,8,{"$f":"IF($B5<=BC5,BE5,IF($B5>=BD5,BF5,BE5+(BF5-BE5)*($B5-BC5)/(BD5-BC5)))","v":3},null,null,null,"Unpredictible traffic incrases the value of a queue warning system",null,null,null,null,null,null,null,null,null,null,null,"Unpredictible traffic incrases the value of a queue warning system"]
[{"$f":"'Step 3a - ADV WZ Analysis'!A14","v":"Is the work zone on a route with an existing ITS Travel Time System?"},{"$f":"'Step 3a - ADV WZ Analysis'!C14","v":0},"Y/N",null,null,null,null,null,null,null,null,null,null,null,null,null,null,null,null,null,null,null,null,null,null,null,null,null,null,null,"No","Yes",5,20,{"$f":"IF($B6<=AE6,AG6,IF($B6>=AF6,AH6,AG6+(AH6-AG6)*($B6-AE6)/(AF6-AE6)))","v":5},{"$f":"-AJ11*0.75","v":-15000},{"$f":"-AK13*0.75","v":-56.25},{"$f":"IF($B6=\"Yes\",AJ6*($B11+B25)+AK6*($B11+B25),0)","v":0},"If this falls within an existing ITS system, then the setup cost is estimted at 75% lower",null,null,null,"No","Yes",5,20,{"$f":"IF($B6<=AQ6,AS6,IF($B6>=AR6,AT6,AS6+(AT6-AS6)*($B6-AQ6)/(AR6-AQ6)))","v":5},{"$f":"-AV11*0.75","v":-15000},{"$f":"-AW13*0.75","v":-56.25},{"$f":"IF(B6=\"Yes\",AV6*(B11+N25)+AW6*(B11+N25),0)","v":0},"An existing ITS system increases the feasibility for and reduces cost for this system.",null,null,null,"No","Yes",5,0,{"$f":"IF($B6<=BC6,BE6,IF($B6>=BD6,BF6,BE6+(BF6-BE6)*($B6-BC6)/(BD6-BC6)))","v":5},null,null,null,"Existing ITS devices may reduce the cost of detecting real-time queues",null,null,null,null,null,null,null,null,null,null,null,"Existing ITS devices may reduce the cost of detecting real-time queues"]
{"$rows_left_out":32}
{"sheet":"Acceleration Calcs","index":7,"n_rows":20,"n_cols":43,"rows_kept":20,"cut":false,"hidden":true,"merged":[[0,24,0,32],[0,34,0,42],[1,32,2,32],[1,4,1,11],[1,12,2,12],[0,4,0,12],[0,14,0,22],[1,14,1,21],[1,22,2,22],[1,24,1,31],[1,34,1,41],[1,42,2,42]]}
[null,null,null,null,"A+B Bidding",null,null,null,null,null,null,null,null,null,"Liquidated Damages Specified",null,null,null,null,null,null,null,null,null,"Liquidated Savings Specified",null,null,null,null,null,null,null,null,null,"Liquidated Savings / Liquidated Damages Specified"]
[null,null,null,null,"Scoring",null,null,null,null,null,null,null,"Comments",null,"Scoring",null,null,null,null,null,null,null,"Comments",null,"Scoring",null,null,null,null,null,null,null,"Comments",null,"Scoring",null,null,null,null,null,null,null,"Comments"]
["Question / Criteria","Value","Unit",null,"Answer 1","Answer 2","Answer 3","Answer 1 Score","Answer 2 Score","Answer 3 Score","Max","Score",null,null,"Answer 1","Answer 2","Answer 3","Answer 1 Score","Answer 2 Score","Answer 3 Score","Max","Score",null,null,"Answer 1","Answer 2","Answer 3","Answer 1 Score","Answer 2 Score","Answer 3 Score","Max","Score",null,null,"Answer 1","Answer 2","Answer 3","Answer 1 Score","Answer 2 Score","Answer 3 Score","Max","Score"]
[{"$f":"'Step 3b - Acceleration Analysis'!A11","v":"Is the project considered \"routine?\""},{"$f":"'Step 3b - Acceleration Analysis'!C11","v":0},"Y/N",null,"No","Yes",null,0,10,null,{"$f":"MAX(H4:J4)","v":10},{"$f":"IF($B4=E4,H4,IF($B4=F4,I4,IF($B4=G4,J4,\"\")))","v":0},null,null,null,null,null,null,null,null,{"$f":"MAX(R4:T4)","v":0},{"$f":"IF($B4=O4,R4,IF($B4=P4,S4,IF($B4=Q4,T4,\"\")))","v":0},null,null,null,null,null,null,null,null,{"$f":"MAX(AB4:AD4)","v":0},{"$f":"IF($B4=Y4,AB4,IF($B4=Z4,AC4,IF($B4=AA4,AD4,\"\")))","v":0},null,null,null,null,null,null,null,null,{"$f":"MAX(AL4:AN4)","v":0},{"$f":"IF($B4=AI4,AL4,IF($B4=AJ4,AM4,IF($B4=AK4,AN4,\"\")))","v":0}]
[{"$f":"'Step 3b - Acceleration Analysis'!A13","v":"What is the anticipated number of construction seasons?"},{"$f":"'Step 3b - Acceleration Analysis'!C13","v":0},"Seasons",null,"more than one","one or somewhat less than one","much less than one",0,10,10,{"$f":"MAX(H5:J5)","v":10},{"$f":"IF($B5=E5,H5,IF($B5=F5,I5,IF($B5=G5,J5,\"\")))","v":""},null,null,"more than one","one or somewhat less than one","much less than one",0,3,10,{"$f":"MAX(R5:T5)","v":10},{"$f":"IF($B5=O5,R5,IF($B5=P5,S5,IF($B5=Q5,T5,\"\")))","v":""},null,null,"more than one","one or somewhat less than one","much less than one",10,5,0,{"$f":"MAX(AB5:AD5)","v":10},{"$f":"IF($B5=Y5,AB5,IF($B5=Z5,AC5,IF($B5=AA5,AD5,\"\")))","v":""},null,null,"more than one","one or somewhat less than one","much less than one",10,3,10,{"$f":"MAX(AL5:AN5)","v":10},{"$f":"IF($B5=AI5,AL5,IF($B5=AJ5,AM5,IF($B5=AK5,AN5,\"\")))","v":""}]
[{"$f":"'Step 3b - Acceleration Analysis'!A15","v":"Is there is a critical completion date (e.g. to enable future work, or other reasons)?"},{"$f":"'Step 3b - Acceleration Analysis'!C15","v":0},"Y/N",null,null,null,null,null,null,null,0,0,null,null,"No","Yes",null,0,10,null,10,0,null,null,"No","Yes",null,0,10,null,10,0,null,null,"No","Yes",null,0,10,null,10,0]
{"$rows_left_out":15}
{"sheet":"Step 1 - Introduction","index":8,"n_rows":34,"n_cols":9,"rows_kept":34,"cut":false,"hidden":false,"merged":[[7,8,11,8],[33,0,33,2],[33,4,33,6],[0,2,0,6],[25,0,25,1],[24,0,24,1],[7,6,11,6],[24,2,24,8]]}
[null,null,"MoDOT WORK ZONE IMPACT ANALYSIS SPREADSHEET"]
["Revised: 4/14/26"]
[]
["Remember to ENABLE CONTENT so the macros inside the excel sheet can run."]
[]
["Select Volume Input Method using the BUTTONS below."]
{"$rows_left_out":29}
{"sheet":"Step 2 - Facility Data Inputs","index":9,"n_rows":51,"n_cols":11,"rows_kept":51,"cut":false,"hidden":true,"merged":[[16,9,16,10],[0,3,0,10],[48,2,48,3],[24,0,24,3],[21,0,21,3],[7,0,7,2],[8,0,8,2],[12,0,12,2],[14,0,14,2],[13,0,13,2],[43,2,43,3],[44,2,44,3],[45,2,45,3],[46,2,46,3],[47,2,47,3],[38,2,38,3],[39,2,39,3],[37,2,37,3],[49,0,49,2],[25,1,36,1],[37,1,48,1],[25,0,48,0],[40,2,40,3],[41,2,41,3],[42,2,42,3],[29,2,29,3],[28,2,28,3],[18,0,18,5],[17,0,17,5],[20,0,20,10],[25,2,25,3],[36,2,36,3],[35,2,35,3],[34,2,34,3],[33,2,33,3],[32,2,32,3],[31,2,31,3],[30,2,30,3],[27,2,27,3],[26,2,26,3],[23,0,23,3],[22,0,22,3],[3,0,3,4],[3,6,3,7],[8,7,8,10],[7,7,7,10],[8,4,8,5],[7,4,7,5]]}
[null,null,null,"WORK ZONE IMPACT ANALYSIS SPREADSHEET"]
["UserInput"]
["ANALYST:",null,null,null,null,null,"DATE OF ANALYSIS:",null,null,"JOB NUMBER:"]
[null,null,null,null,null,null,{"$f":"TODAY()","v":"2026-05-27"}]
[]
["BACKGROUND INFORMATION"]
{"$rows_left_out":46}
{"sheet":"Step 3 - WZ Analysis","index":10,"n_rows":156,"n_cols":7,"rows_kept":156,"cut":false,"hidden":true,"merged":[[136,0,156,0],[138,4,138,5],[141,3,141,5],[142,3,142,5],[143,3,143,5],[144,3,144,5],[145,3,145,5],[147,3,147,5],[148,3,148,5],[149,3,149,5],[139,3,139,5],[140,3,140,5],[114,0,134,0],[116,4,116,5],[119,3,119,5],[120,3,120,5],[121,3,121,5],[122,3,122,5],[123,3,123,5],[125,3,125,5],[126,3,126,5],[127,3,127,5],[117,3,117,5],[118,3,118,5],[92,0,112,0],[94,4,94,5],[97,3,97,5],[98,3,98,5],[99,3,99,5],[100,3,100,5],[101,3,101,5],[103,3,103,5],[104,3,104,5],[105,3,105,5],[95,3,95,5],[96,3,96,5],[70,0,90,0],[72,4,72,5],[75,3,75,5],[76,3,76,5],[77,3,77,5],[78,3,78,5],[79,3,79,5],[81,3,81,5],[82,3,82,5],[83,3,83,5],[48,0,68,0],[50,4,50,5],[53,3,53,5],[54,3,54,5],[55,3,55,5],[56,3,56,5],[57,3,57,5],[59,3,59,5],[60,3,60,5],[61,3,61,5],[4,0,24,0],[6,4,6,5],[0,0,0,13],[9,3,9,5],[26,0,46,0],[28,4,28,5],[31,3,31,5],[32,3,32,5],[33,3,33,5],[34,3,34,5],[35,3,35,5],[37,3,37,5],[38,3,38,5],[39,3,39,5],[10,3,10,5],[17,3,17,5],[7,3,7,5],[8,3,8,5],[29,3,29,5],[16,3,16,5],[15,3,15,5],[13,3,13,5],[12,3,12,5],[11,3,11,5],[30,3,30,5],[51,3,51,5],[52,3,52,5],[73,3,73,5],[74,3,74,5]]}
["              WORK ZONE IMPACT ANALYSIS SPREADSHEET"]
[]
[{"$f":"CONCATENATE(\"District: \",'Step 2 - Facility Data Inputs'!A9,\"      Route: \",'Step 2 - Facility Data Inputs'!E9,\" (\",'Step 2 - Facility Data Inputs'!H9,\")\",\"      Job No.: \",'Step 2 - Facility Data Inputs'!J4)","v":"District:       Route:  ()      Job No.: "}]
[]
[{"$f":"CONCATENATE('Step 2 - Facility Data Inputs'!E22,\"(\",TEXT('Step 2 - Facility Data Inputs'!E23,\"m/d/yy\"),\")\")","v":"Sunday()"},{"$f":"'Step 2 - Facility Data Inputs'!E25","v":0}]
[null,null,"BASE CONDITIONS"]
{"$rows_left_out":151}
{"sheet":"Step 3a - ADV WZ Analysis","index":11,"n_rows":46,"n_cols":1,"rows_kept":46,"cut":false,"hidden":true,"merged":[[0,0,0,5],[7,0,7,3],[23,0,23,3]]}
["              WORK ZONE IMPACT ANALYSIS SPREADSHEET"]
[]
[{"$f":"CONCATENATE(\"District: \",'Step 2 - Facility Data Inputs'!A9,\"      Route: \",'Step 2 - Facility Data Inputs'!E9,\" (\",'Step 2 - Facility Data Inputs'!H9,\")\",\"      Job No.: \",'Step 2 - Facility Data Inputs'!J4)","v":"District:       Route:  ()      Job No.: "}]
[]
[]
["Additional Questions for Advanced Work Zone Strategy Recommendation"]
{"$rows_left_out":41}
{"sheet":"Step 3b - Acceleration Analysis","index":12,"n_rows":31,"n_cols":1,"rows_kept":31,"cut":false,"hidden":true,"merged":[[0,0,0,5],[8,0,8,3]]}
["              WORK ZONE IMPACT ANALYSIS SPREADSHEET"]
[]
[{"$f":"CONCATENATE(\"District: \",'Step 2 - Facility Data Inputs'!A9,\"      Route: \",'Step 2 - Facility Data Inputs'!E9,\" (\",'Step 2 - Facility Data Inputs'!H9,\")\",\"      Job No.: \",'Step 2 - Facility Data Inputs'!J4)","v":"District:       Route:  ()      Job No.: "}]
[]
[]
["Contract Time Acceleration Considerations"]
{"$rows_left_out":26}
{"sheet":"Step 4 - Synopsis Sheet","index":13,"n_rows":51,"n_cols":3,"rows_kept":51,"cut":false,"hidden":true,"merged":[[0,0,0,13],[24,1,24,2],[31,1,31,2],[38,1,38,2],[45,1,45,2],[3,0,8,0],[10,0,15,0],[17,0,22,0],[24,0,29,0],[31,0,36,0],[38,0,43,0],[45,0,50,0],[3,1,3,2],[10,1,10,2],[17,1,17,2]]}
["              WORK ZONE IMPACT ANALYSIS SPREADSHEET"]
[{"$f":"CONCATENATE(\"District: \",'Step 2 - Facility Data Inputs'!A9,\"      Route: \",'Step 2 - Facility Data Inputs'!E9,\" (\",'Step 2 - Facility Data Inputs'!H9,\")\",\"      Job No.: \",'Step 2 - Facility Data Inputs'!J4)","v":"District:       Route:  ()      Job No.: "}]
[{"$f":"CONCATENATE('Step 2 - Facility Data Inputs'!E22,\" (\",TEXT('Step 2 - Facility Data Inputs'!E23,\"m/d/yy\"),\") \",B4)","v":"Sunday () No Work Zone"}]
[{"$f":"CONCATENATE('Step 2 - Facility Data Inputs'!E22,\"\n(\",TEXT('Step 2 - Facility Data Inputs'!E23,\"m/d/yy\"),\")\")","v":"Sunday\n()"},{"$f":"IF('Step 3 - WZ Analysis'!D10=\"(Example: Pothole Patching - Close One Lane OR Joint Repair - Two Lanes Closed)\",IF('Step 3 - WZ Analysis'!D11='Reference Sheet'!$R$2,\"No Work Zone\",'Step 3 - WZ Analysis'!D11),'Step 3 - WZ Analysis'!D10)","v":"No Work Zone"}]
[null,{"$f":"'Step 3 - WZ Analysis'!C22","v":"Max Queue Length (mi):"},{"$f":"'Step 3 - WZ Analysis'!F22","v":0}]
[null,{"$f":"'Step 3 - WZ Analysis'!C23","v":"Max Delay (minutes):"},{"$f":"'Step 3 - WZ Analysis'!F23","v":0}]
{"$rows_left_out":46}
{"sheet":"Step 4a - ADV WZ Synopsis","index":14,"n_rows":32,"n_cols":10,"rows_kept":32,"cut":false,"hidden":true,"merged":[[0,0,0,10],[19,5,19,7],[4,1,4,4]]}
["              WORK ZONE IMPACT ANALYSIS SPREADSHEET"]
[{"$f":"CONCATENATE(\"District: \",'Step 2 - Facility Data Inputs'!A9,\"      Route: \",'Step 2 - Facility Data Inputs'!E9,\" (\",'Step 2 - Facility Data Inputs'!H9,\")\",\"      Job No.: \",'Step 2 - Facility Data Inputs'!J4)","v":"District:       Route:  ()      Job No.: "}]
[]
["Advanced Work Zone Strategy Analysis"]
[null,"From SWZ Calc Sheet"]
["Advanced Work Zone Strategy","Applicable","Base Points","Manual Adjustment","Cost","Score*","Rank","Recommendation","Budgetary Estimate"]
{"$rows_left_out":27}
{"sheet":"Step 4b - Acceleration Synopsis","index":15,"n_rows":26,"n_cols":6,"rows_kept":26,"cut":false,"hidden":true,"merged":[[0,0,0,7],[4,1,4,2],[14,3,14,5]]}
["              WORK ZONE IMPACT ANALYSIS SPREADSHEET"]
[{"$f":"CONCATENATE(\"District: \",'Step 2 - Facility Data Inputs'!A9,\"      Route: \",'Step 2 - Facility Data Inputs'!E9,\" (\",'Step 2 - Facility Data Inputs'!H9,\")\",\"      Job No.: \",'Step 2 - Facility Data Inputs'!J4)","v":"District:       Route:  ()      Job No.: "}]
[]
["Contract Time Acceleration Synopsis*"]
[null,"From Acceleration Calcs"]
["Contract Time Acceleration Strategy","Base Points","Manual Adjustment","Score**","Rank","Recommendation"]
{"$rows_left_out":20}